{"text_format":"1","workbook":"xlsx","n_sheets":36,"sheets":["Mẫu số 11. Bảng giá dự thầu","Mẫu số 11C. Bảng giá dự thầu","Bìa","Thuyết minh","Info","Options","Dự toán XDCT","Data","Tổng hợp CPTB","Chi phí MSTB","THCP Tư vấn","Mẫu Tổng hợp","CP HMC","CP Chuyên gia","CP Tư vấn khác","THKL","CTKL","CP Dự phòng","Tổng hợp CPXD","Dự toán","Draff","Đơn giá","Hợp giá","Phân tích hao phí","Vật liệu VC-89","Tổng hợp vật tư","PLBC.Thẩmtra","Báo cáo","Giá vữa","Giá Vật liệu đến HTCT","Giá ca máy (VCVL)","Đơn giá NC","Giá ca máy","Lương Lái máy","CB ĐGNC","Bảng lương"],"not_rendered":{"charts":0,"images":2,"macros":1,"external_links":0,"defined_names":463,"comments":7,"pivot_tables":0},"unopened":[],"bounds":{"document_bytes":16777216,"sheet_cells":100000,"rows_first":2000,"rows_last":500,"rows_between":2000,"halvings":0,"cell_chars":16384,"cell_head_chars":4096},"cells_cut":0,"cells_raw":0,"read":"whole","date_system":"1900"}

{"sheet":"Mẫu số 11. Bảng giá dự thầu","index":0,"n_rows":5,"n_cols":5,"rows_kept":5,"cut":false,"hidden":true,"merged":[[0,0,2,3]]}
["MẪU SỐ 11. BẢNG TỔNG HỢP GIÁ DỰ THẦU"]
[]
[]
["","","","",""]
["STT","Mô tả công việc(2)","Đơn vị tính","Giá theo hạng mục(3)"]

{"sheet":"Mẫu số 11C. Bảng giá dự thầu","index":1,"n_rows":5,"n_cols":8,"rows_kept":5,"cut":false,"hidden":true,"merged":[[0,0,2,7]]}
["MẪU SỐ 11C. BẢNG TỔNG HỢP GIÁ DỰ THẦU"]
[]
[]
["","","","","","","",""]
["STT","Id","Mô tả công việc mời thầu","Yêu cầu kỹ thuật/Chỉ dẫn kỹ thuật chính","Khối lượng mời thầu","Đơn vị tính","Đơn giá dự thầu","Thành tiền"]

{"sheet":"Bìa","index":2,"n_rows":86,"n_cols":24,"rows_kept":86,"cut":false,"hidden":true,"merged":[[3,12,4,21],[37,2,37,12],[5,2,5,12]]}
[]
[]
[]
[null,null,null,null,null,null,null,null,null,null,null,null,{"$f":"Info!D14","v":"Công ty …................................................"}]
[]
[null,null,"www.ungdungxaydung.com"]
[]
[]
[]
[]
[null,null,"HỒ SƠ DỰ TOÁN"]
[null,null,null,null,{"$f":"Info!$C$5&Info!$D$5","v":"Dự án: Dự án đầu tư xây dựng công trình …"}]
[null,null,null,null,{"$f":"Info!$C$6&Info!$D$6","v":"Công trình: Công trình xây dựng …"}]
[null,null,null,null,{"$f":"Info!$C$8&Info!$D$8","v":"Địa điểm xây dựng: Hà Nội …"}]
[null,null,null,null,{"$f":"Info!$C$12&Info!$D$12","v":"Chủ đầu tư: UBND…"}]
[null,null,null,null,{"$f":"Info!$C$14&Info!$D$14","v":"Tư vấn thiết kế: Công ty …................................................"}]
[]
[]
[]
[]
[]
[]
[]
[]
[]
[]
[]
[]
[null,null,null,null,null,null,null,null,null,null,null,null,null,null,null,"…....., năm 2024"]
[]
[]
[]
[]
[]
[]
[null,null,null,null,null,null,null,null,{"$f":"Info!D14","v":"Công ty …................................................"}]
[]
[null,null,"www.ungdungxaydung.com"]
[]
[]
[]
[]
[]
[]
[]
[]
[]
[]
[null,null,null,null,null,null,null,null,null,null,null,null,"HỒ SƠ DỰ TOÁN"]
[null,null,null,{"$f":"Info!$C$5&Info!$D$5","v":"Dự án: Dự án đầu tư xây dựng công trình …"}]
[null,null,null,{"$f":"Info!$C$6&Info!$D$6","v":"Công trình: Công trình xây dựng …"}]
[null,null,null,{"$f":"Info!$C$8&Info!$D$8","v":"Địa điểm xây dựng: Hà Nội …"}]
[null,null,null,{"$f":"Info!$C$12&Info!$D$12","v":"Chủ đầu tư: UBND…"}]
[null,null,null,{"$f":"Info!$C$14&Info!$D$14","v":"Tư vấn thiết kế: Công ty …................................................"}]
[]
[]
[]
[]
[]
[]
[]
[]
[]
[]
[]
[]
[]
[]
[]
[]
[]
[]
[]
[]
[]
[]
[]
[]
[]
[]
[]
[]
[]
[]
[null,null,null,null,null,null,null,null,null,null,"Hà Nội, năm 2024"]
[null,null,null,null,null,null,null,null,null,null,null,null,null,null,null,null,null,null,null,null,null,null,null,"_"]

{"sheet":"Thuyết minh","index":3,"n_rows":29,"n_cols":28,"rows_kept":29,"cut":false,"hidden":true,"merged":[[21,6,21,11],[3,1,4,11],[3,15,3,25],[4,15,4,25],[15,1,15,26]]}
[]
[null,null,null,null,null,null,null,null,null,null,null,null,null,null,null,null,null,null,null,null,null,null,null,null,null,null,null,"_"]
[]
[null,{"$f":"UPPER(Info!D14)","v":"CÔNG TY …................................................"},null,null,null,null,null,null,null,null,null,null,null,null,null,"CỘNG HÒA XÃ HỘI CHỦ NGHĨA VIỆT NAM"]
[null,null,null,null,null,null,null,null,null,null,null,null,null,null,null,"Độc lập - Tự do - Hạnh phúc"]
[]
[null,"THUYẾT MINH DỰ TOÁN"]
[null,{"$f":"Info!$C$5&Info!$D$5","v":"Dự án: Dự án đầu tư xây dựng công trình …"}]
[null,{"$f":"Info!$C$6&Info!$D$6","v":"Công trình: Công trình xây dựng …"}]
[null,{"$f":"Info!C8&Info!D8","v":"Địa điểm xây dựng: Hà Nội …"}]
[null,"I. Căn cứ lập dự toán:"]
[null," - Nghị định số 10/2021/NĐ-CP ngày 09/02/2021 của Chính phủ về Quản lý chi phí đầu tư xây dựng;"]
[null," - Thông tư 11/2021/TT-BXD ngày 31/08/2021 của Bộ Xây dựng hướng dẫn xác định và quản lý chi phí đầu tư xây dựng;"]
[null," - Thông tư 12/2021/TT-BXD ngày 31/08/2021 của Bộ Xây dựng ban hành định mức xây dựng;"]
[null," - Thông tư 13/2021/TT-BXD ngày 31/08/2021 của Bộ Xây dựng hướng dẫn xác định các chỉ tiêu kinh tế kỹ thuật và đo bóc khối lượng công trình;"]
[null," - Thông tư số 209/2016/TT- BTC ngày 10/11/2016 của Bộ Tài chính hướng dẫn chế độ thu, nộp và quản lý sử dụng phí thẩm định dự án đầu tư xây dựng, phí thẩm định thiết kế cơ sở;"]
[null," - Văn bản số ….............. ngày … / … / 20… về việc Công bố giá vật liệu Liên Sở Xây dựng - Tài chính tỉnh ...."]
[null," - Văn bản số ….............. ngày … / … / 20… về việc Công bố giá nhân công xây dựng tỉnh ...."]
[null," - Văn bản số ….............. ngày … / … / 20… về việc Công bố bảng Giá ca máy và thiết bị thi công tỉnh ...."]
[null," - Quyết định số …..../QĐ…....... ngày … /…./202… về việc phê duyệt dự án…..."]
[null," - Một số tài liệu khác có liên quan."]
[null,"II. Giá trị dự toán: ",null,null,null,null,{"$f":"'Tổng hợp CPXD'!E30","v":0},null,null,null,null,null,"đồng."]
[null,{"$f":"\"Bằng chữ: \"&doc_vnd(G22)&\"/.\"","v":"Bằng chữ:  đồng./."}]
[null,null,null,null,null,null,null,null,null,null,null,null,null,null,null,null,null,null,null,".... , ngày .… tháng …. năm 202…"]
[null,null,null,null,null,null,null,null,null,null,null,null,null,null,null,null,null,null,null,null,null,"ĐƠN VỊ LẬP"]
[]
[]
[]
[null,null,null,null,null,null,null,null,null,null,null,null,null,null,null,null,null,null,null,null,null,null,null,null,null,null,null,"_"]

{"sheet":"Info","index":4,"n_rows":35,"n_cols":15,"rows_kept":35,"cut":false,"hidden":false,"merged":[[4,3,4,4],[5,3,5,4],[6,3,6,4],[7,3,7,4],[12,3,12,4],[10,3,10,4],[8,1,9,1],[8,2,9,2],[32,4,33,4],[14,3,14,4],[11,3,11,4],[13,3,13,4],[15,3,15,4],[16,3,16,4]]}
[]
[null,null,"THÔNG TIN CÔNG TRÌNH",null,null,null,null,null,null,null,null,"TColor","TPColor","BLColor","ACColor"]
[]
[null,null,"Thông tin chung"]
[null,"◦","Dự án: ","Dự án đầu tư xây dựng công trình …"]
[null,"◦","Công trình: ","Công trình xây dựng …"]
[null,"◦","Tên gói thầu: ","Thi công xây lắp …"]
[null,"◦","Địa điểm xây dựng: ","Hà Nội …"]
[null,"◦","Loại công trình: ",{"$f":"VLOOKUP(Options!$N$12,Options!$N$13:$O$17,2,0)","v":"Công trình dân dụng"}]
[]
[null,"◦","Chi phí Xây dựng trước thuế trong Tổng mức đầu tư "]
[null,"◦","Chủ đầu tư: ","UBND…"]
[null,"◦","Ban quản lý dự án: ","Ban Quản lý dự án PMU"]
[null,"◦","Tư vấn thiết kế: ","Công ty …................................................"]
[null,"◦","Đơn vị khác 1 ","…"]
[null,"◦","Đơn vị khác 2","…"]
[null,"◦","Đơn vị khác 3","…"]
[null,null,"\nCác hệ số và định mức tỷ lệ"]
[null,null,"NỘI DUNG","Nhập ▼","Ghi chú"]
[null,"Kvl","Hệ số vật liệu",1]
[null,"Knc","Hệ số nhân công",1]
[null,"Kmtc","Hệ số máy thi công",1]
[null,"C",{"$f":"Options!I13","v":"Định mức chi phí chung tính trên chi phí trực tiếp (C)"},{"$f":"Options!$J$13","v":7.2999999999999995E-2}]
[null,"TL","Thu nhập chịu thuế tính trước",{"$f":"Options!$J$14","v":5.5E-2}]
[null,"GTGT","Thuế giá trị gia tăng",0.1]
[null,"Gnt","Chi phí xây dựng lán trại, nhà tạm để ở và điều hành thi công",{"$f":"Options!$J$16","v":1.1000000000000001E-2}]
[null,"Gk","Chi phí không xác định được khối lượng từ thiết kế",{"$f":"Options!$J$17","v":2.5000000000000001E-2}]
[null,"Hsdp1","Dự phòng phát sinh khối lượng",0.05]
[null,"Hsdp2","Dự phòng trượt giá",0.08]
[]
[null,null,"\nGiá nhiên liệu năng lượng"]
[null,null,"Loại","Nhập giá trước thuế ▼","Căn cứ"]
[null," ","Xăng (lít) :",null,"Thông cáo BC Petrolimex\ntại thời điểm lập dự toán"]
[null," ","Diezel (lít) :"]
[null," ","Điện (KWh) :",2006.79,"Quyết định số 1416/QĐ-EVN ngày 08/11/2023"]

{"sheet":"Options","index":5,"n_rows":55,"n_cols":60,"rows_kept":55,"cut":false,"hidden":true,"merged":[[24,12,28,12],[30,12,31,12],[12,12,19,12],[21,12,22,12],[2,12,9,12]]}
[]
[null,null,"OPTIONS",null,null,null,null,null,null,null,null,null,"Tham số",{"$f":"INDEX($N$3:$N$9,MATCH($E$23,$O$3:$O$9,0))","v":1},{"$f":"INDEX(O3:O9,N2)","v":"Chi phí Xây dựng | Phụ lục số 3 Thông tư 11/2021/TT-BXD"},{"$f":"IF(ISNUMBER(FIND(\"11/2021\",O2)),\"TT11\",IF(ISNUMBER(FIND(\"09/2019\",O2)),\"TT09\",IF(ISNUMBER(FIND(\"06/2016\",O2)),\"TT06\",\"TT11\")))","v":"TT11"}]
[null,null,null,null,null,null,null,null,null,null,null,null,"Mẫu chi phí đuôi",1,"Chi phí Xây dựng | Phụ lục số 3 Thông tư 11/2021/TT-BXD"]
[null,null,null,null,null,null,null,null,null,null,null,null,null,2,"Chi phí Khảo sát | Phụ lục số 5 Thông tư 11/2021/TT-BXD",null,null,null,null,null,null,null,null,null,null,null,null,null,null,null,null,null,null,null,null,null,null,null,null,null,null,null,null,null,null,null,null,null,null,null,null,null,null,null,"Thông tư 14/2017/TT-BXD Hướng dẫn xác định và quản lý chi phí dịch vụ công ích đô thị"]
[null,null,null,null,null,null,null,null,null,null,null,null,null,3,"Chi phí Xây dựng | Phụ lục số 3 Thông tư 09/2019/TT-BXD",null,null,null,null,null,null,null,null,null,null,null,null,null,null,null,null,null,null,null,null,null,null,null,null,null,null,null,null,null,null,null,null,null,null,null,null,null,null,null,"TT","Loại dịch vụ công ích","Loại đô thị"]
[null,null,null,null,null,null,null,null,null,null,null,null,null,4,"Chi phí Dịch vụ công ích đô thị | Thông tư 14/2017/TT-BXD",null,null,null,"Thông tư 06/2016",null,null,null,null,null,null,null,null,null,null,"Thông tư 09/2019",null,null,null,null,null,null,null,null,null,null,"Thông tư 11/2021",null,null,null,null,null,null,null,null,null,null,null,null,null,{"$f":"$N$12-5","v":-4},null,"Đặc biệt","I","II","III ÷ V"]
[null,null,null,null,null,null,null,null,null,null,null,null,null,5,"Chi phí Xây dựng | Thông tư 06/2016/TT-BXD",null,null,null,"STT","LOẠI CÔNG TRÌNH","CKKL","C",null,"TN","LT",null,null,null,null,"STT","LOẠI CÔNG TRÌNH","CKKL","C",null,"LT","NT",null,null,null,null,"STT","LOẠI CÔNG TRÌNH","CKKL","C",null,"LT","NT",null,null,null,null,null,null,null,1,"Thu gom, vận chuyển chất thải rắn sinh hoạt đô thị",55,53,50,48]
[null,null,null,null,null,null,null,null,null,null,null,null,null,6,"Mẫu Dự thầu HĐ đơn giá cố định",null,null,null,1,"Công trình dân dụng",{"$f":"IFERROR(INDEX(U9:U10,$P$12,0),U9)","v":2.5},{"$f":"IFERROR(INDEX(V9:V10,$P$12,0),V9)","v":6.5},{"$f":"IFERROR(INDEX(W9:W10,$P$12,0),W9)","v":"Định mức chi phí chung tính trên chi phí trực tiếp (C)"},5.5,0.01,null,null,null,null,1,"Công trình dân dụng",{"$f":"IFERROR(INDEX(AF9:AF10,$P$12,0),AF9)","v":2.5},{"$f":"IFERROR(INDEX(AG9:AG10,$P$12,0),AG9)","v":7.3},{"$f":"IFERROR(INDEX(AH9:AH10,$P$12,0),AH9)","v":"Định mức chi phí chung tính trên chi phí trực tiếp (C)"},5.5,{"$f":"IF($K$16=1,$AM$48,$AM$49)/100","v":1.2E-2},null,null,null,null,1,"Công trình dân dụng",{"$f":"IFERROR(INDEX(AQ9:AQ10,$P$12,0),AQ9)","v":2.5},{"$f":"IFERROR(INDEX(AR9:AR10,$P$12,0),AR9)","v":7.3},{"$f":"IFERROR(INDEX(AS9:AS10,$P$12,0),AS9)","v":"Định mức chi phí chung tính trên chi phí trực tiếp (C)"},5.5,{"$f":"IF($K$16=1,$AX$48,$AX$49)/100","v":1.1000000000000001E-2},null,null,null,null,null,null,null,2,"Duy trì hệ thống chiếu sáng đô thị",52,50,48,45]
[null,null,null,null,null,null,null,null,null,null,null,null,null,7,"Mẫu Dự thầu HĐ đơn giá điều chỉnh",null,null,null,null,"Thông thường",2.5,{"$f":"AB28","v":6.5},"Định mức chi phí chung tính trên chi phí trực tiếp (C)",null,null,null,null,null,null,null,"Thông thường",2.5,{"$f":"AM28","v":7.3},"Định mức chi phí chung tính trên chi phí trực tiếp (C)",null,null,null,null,null,null,null,"Thông thường",2.5,{"$f":"BA28","v":7.3},"Định mức chi phí chung tính trên chi phí trực tiếp (C)",null,null,null,null,null,null,null,null,null,3,"Duy trì, phát triển hệ thống cây xanh đô thị",50,48,47,45]
[null,null,null,null,null,null,null,null,null,null,null,null,null,8,"Mẫu Dự thầu HĐ trọn gói",null,null," ",null,"Riêng công trình tu bổ, phục hồi di tích lịch sử, văn hóa",2.5,{"$f":"AB29","v":10},"Định mức chi phí chung tính trên chi phí trực tiếp (C)",null,null,null,null,null,null,null,"Công trình tu bổ, phục hồi di tích lịch sử, văn hóa",2.5,{"$f":"AM29","v":11.6},"Định mức chi phí chung tính trên chi phí trực tiếp (C)",null,null,null,null,null,null,null,"Riêng công trình tu bổ, phục hồi di tích lịch sử, văn hóa",2.5,{"$f":"BA29","v":11.6},"Định mức chi phí chung tính trên chi phí trực tiếp (C)",null,null,null,null,null,null,null,null,null,{"$f":"VLOOKUP($BC$6,$BC$7:$BH$9,2+$BC$12)/100","v":{"$error":"#N/A"}},"ĐMTL CP Chung đưa sang Info"]
[null,null,"PARAMETERS",null,null,null,null,null,null,null,null,null,null,null,null,{"$f":"IF(Mau_Thongtu=\"TT11\",\"$AP$8:$AP$25\",IF(Mau_Thongtu=\"TT09\",\"$AE$8:$AE$25\",\"$T$8:$T$25\"))","v":"$AP$8:$AP$25"},null," ",2,"Công trình công nghiệp",{"$f":"INDEX(U12:U14,$P$12,0)","v":2},{"$f":"INDEX(V12:V14,$P$12,0)","v":5.5},{"$f":"INDEX(W12:W14,$P$12,0)","v":"Định mức chi phí chung tính trên chi phí trực tiếp (C)"},6,0.01,null,null,null,null,2,"Công trình công nghiệp",{"$f":"INDEX(AF12:AF14,$P$12,0)","v":2},{"$f":"INDEX(AG12:AG14,$P$12,0)","v":6.2},{"$f":"INDEX(AH12:AH14,$P$12,0)","v":"Định mức chi phí chung tính trên chi phí trực tiếp (C)"},6,{"$f":"IF($K$16=1,$AM$48,$AM$49)/100","v":1.2E-2},null,null,null,null,2,"Công trình công nghiệp",{"$f":"INDEX(AQ12:AQ14,$P$12,0)","v":2},{"$f":"INDEX(AR12:AR14,$P$12,0)","v":6.2},{"$f":"INDEX(AS12:AS14,$P$12,0)","v":"Định mức chi phí chung tính trên chi phí trực tiếp (C)"},6,{"$f":"IF($K$16=1,$AX$48,$AX$49)/100","v":1.1000000000000001E-2}]
[null,1,"ChooseNo.code",null,null,null,null,null,"Chuyển bảng Info",null,null,null,"Tham số",1,{"$f":"INDEX(O13:O20,N12)","v":"Công trình dân dụng"},1,null," ",null,"Thông thường",2,{"$f":"AB30","v":5.5},"Định mức chi phí chung tính trên chi phí trực tiếp (C)",null,null,null,null,null,null,null,"Thông thường",2,{"$f":"AM30","v":6.2},"Định mức chi phí chung tính trên chi phí trực tiếp (C)",null,null,null,null,null,null,null,"Thông thường",2,{"$f":"BA30","v":6.2},"Định mức chi phí chung tính trên chi phí trực tiếp (C)",null,null,null,null,null,null,null,null,null,{"$f":"$P$12","v":1},"Loại đô thị"]
[null,2,"Vector",null,"4ca79bbed0ad07f267b9c1bc1445fef3",null,null,"C",{"$f":"IFERROR(IF(Mau_Thongtu=\"TT09\",VLOOKUP($N$12,$AD$8:$AI$27,5,0),IF(Mau_Thongtu=\"TT11\",VLOOKUP($N$12,$AO$8:$AU$24,5,0),IF(Mau_Thongtu=\"TT06\",VLOOKUP($N$12,$S$8:$X$24,5,0)))),\"Định mức chi phí quản lý chung tính trên chi phí nhân công (C)\")","v":"Định mức chi phí chung tính trên chi phí trực tiếp (C)"},{"$f":"IFERROR(IF(Mau_Thongtu=\"TT11\",VLOOKUP($N$12,$AO$8:$AT$24,4,0)/100,IF(Mau_Thongtu=\"TT09\",VLOOKUP($N$12,$AD$8:$AI$24,4,0)/100,IF(Mau_Thongtu=\"TT06\",VLOOKUP($N$12,$S$8:$X$24,4,0)/100))),$BC$10)","v":7.2999999999999995E-2},null,null,"Loại công trình",1,"Công trình dân dụng",{"$f":"IF($N$12>5,$BD$13,INDEX(INDIRECT($P$11),MATCH($O$12,INDIRECT($P$11),0)+1,1))","v":"Thông thường"},null," ",null,"Riêng công tác xây dựng trong đường hầm thủy điện, hầm lò",6.5,{"$f":"AB31","v":6.5},"Định mức chi phí chung tính trên chi phí trực tiếp (C)",null,null,null,null,null,null,null,"Công trình xây dựng hầm lò, hầm thủy điện",6.5,{"$f":"AM31","v":7.3},"Định mức chi phí chung tính trên chi phí trực tiếp (C)",null,null,null,null,null,null,null,"Riêng công tác xây dựng trong đường hầm thủy điện, hầm lò",6.5,{"$f":"BA31","v":7.3},"Định mức chi phí chung tính trên chi phí trực tiếp (C)",null,null,null,null,null,null,null,null,null,1,"Đô thị loại Đặc biệt"]
[null,3,"Volumn Detail",1,0,"1-Có 0-Không",null,"TL","Thu nhập chịu thuế tính trước",{"$f":"IFERROR(IF(Mau_Thongtu=\"TT11\",VLOOKUP($N$12,$AO$8:$AT$24,6,0)/100,IF(Mau_Thongtu=\"TT09\",VLOOKUP($N$12,$AD$8:$AI$24,6,0)/100,IF(Mau_Thongtu=\"TT06\",VLOOKUP($N$12,$S$8:$X$24,6,0)/100))),5%)","v":5.5E-2},null,null,null,2,"Công trình công nghiệp",{"$f":"IF($N$12>5,$BD$14,INDEX(INDIRECT($P$11),MATCH($O$12,INDIRECT($P$11),0)+2,1))","v":"Riêng công trình tu bổ, phục hồi di tích lịch sử, văn hóa"},null," ",null,"Công tác lắp đặt thiết bị công nghệ, thí nghiệm hiệu chỉnh đường dây và trạm biến áp",2,{"$f":"AB$43","v":65},"Định mức chi phí chung tính trên chi phí nhân công (C)",null,null,null,null,null,null,null,"Công tác lắp đặt thiết bị công nghệ, thí nghiệm hiệu chỉnh đường dây và trạm biến áp",2,{"$f":"AM$43","v":65},"Định mức chi phí chung tính trên chi phí nhân công (C)",null,null,null,null,null,null,null,"Lắp đặt thiết bị công nghệ trong các công trình xây dựng; xây dựng và lắp đặt đường dây tải điện; lắp đặt trạm biến áp; thí nghiệm hiệu chỉnh điện đường dây và trạm biến áp; thí nghiệm vật liệu, cấu kiện và kết cấu xây dựng",2,{"$f":"AY43","v":65},"Định mức chi phí chung tính trên chi phí nhân công (C)",null,null,null,null,null,null,null,null,null,2,"Đô thị loại I"]
[null,4,"VLP",null,null,"1-Có 0-Không",null,"GTGT","Thuế giá trị gia tăng",0.1,null,null,null,3,"Công trình giao thông",{"$f":"IF($N$12>5,$BD$15,IF(OR($N$12=1,$N$12=5),\"\",INDEX(INDIRECT($P$11),MATCH($O$12,INDIRECT($P$11),0)+3,1)))","v":""},null,null,3,"Công trình giao thông",{"$f":"INDEX(U16:U18,$P$12,0)","v":2},{"$f":"INDEX(V16:V18,$P$12,0)","v":5.5},{"$f":"INDEX(W16:W18,$P$12,0)","v":"Định mức chi phí chung tính trên chi phí trực tiếp (C)"},6,{"$f":"IF($K$16=1,2%,1%)","v":0.01},null,null,null,null,3,"Công trình giao thông",{"$f":"INDEX(AF16:AF18,$P$12,0)","v":2},{"$f":"INDEX(AG16:AG18,$P$12,0)","v":6.2},{"$f":"INDEX(AH16:AH18,$P$12,0)","v":"Định mức chi phí chung tính trên chi phí trực tiếp (C)"},6,{"$f":"IF($K$16=1,$AM$48,$AM$49)/100","v":1.2E-2},null,null,null,null,3,"Công trình giao thông",{"$f":"INDEX(AQ16:AQ18,$P$12,0)","v":2},{"$f":"INDEX(AR16:AR18,$P$12,0)","v":6.2},{"$f":"INDEX(AS16:AS18,$P$12,0)","v":"Định mức chi phí chung tính trên chi phí trực tiếp (C)"},6,{"$f":"IF($K$16=1,$AX$48,$AX$49)/100","v":1.1000000000000001E-2},null,null,null,null,null,null,null,3,"Đô thị loại II"]
[null,5,"CountDGinBill",null,{"$f":"COUNTA('Dự toán'!$F$9:$F$23)","v":0},null,null,"Gnt","Chi phí xây dựng lán trại, nhà tạm để ở và điều hành thi công",{"$f":"IFERROR(IF(Mau_Thongtu=\"TT11\",VLOOKUP($N$12,$AO$8:$AU$24,7,0),IF(Mau_Thongtu=\"TT09\",VLOOKUP($N$12,$AD$8:$AJ$24,7,0),IF(Mau_Thongtu=\"TT06\",VLOOKUP($N$12,$S$8:$Y$24,7,0)))),\"Không có\")","v":1.1000000000000001E-2},2,null,null,4,"Công trình nông nghiệp và phát triển nông thôn",{"$f":"IF($N$12>5,$BD$16,\"\")","v":""},null,null,null,"Thông thường",2,{"$f":"AB32","v":5.5},"Định mức chi phí chung tính trên chi phí trực tiếp (C)",null,null,null,null,null,null,null,"Thông thường",2,{"$f":"AM32","v":6.2},"Định mức chi phí chung tính trên chi phí trực tiếp (C)",null,null,null,null,null,null,null,"Thông thường",2,{"$f":"BA32","v":6.2},"Định mức chi phí chung tính trên chi phí trực tiếp (C)",null,null,null,null,null,null,null,null,null,4,"Đô thị loại III ÷ V"]
[null,6,"CountDGinDetail",null,{"$f":"COUNTA('Đơn giá'!$F$9:$F$12)","v":1},null,null,"Gk","Chi phí không xác định được khối lượng từ thiết kế",{"$f":"IFERROR(IF(Mau_Thongtu=\"TT11\",VLOOKUP($N$12,$AO$8:$AU$24,3,0)/100,IF(Mau_Thongtu=\"TT09\",VLOOKUP($N$12,$AD$8:$AI$24,3,0)/100,IF(Mau_Thongtu=\"TT06\",VLOOKUP($N$12,$S$8:$X$24,3,0)/100))),\"Không có\")","v":2.5000000000000001E-2},null,null,null,5,"Công trình hạ tầng kỹ thuật",null,null,null,null,"Riêng công tác xây dựng trong đường hầm giao thông",6.5,{"$f":"AB33","v":6.5},"Định mức chi phí chung tính trên chi phí trực tiếp (C)",null,null,null,null,null,null,null,"Công trình hầm giao thông",6.5,{"$f":"AM33","v":7.3},"Định mức chi phí chung tính trên chi phí trực tiếp (C)",null,null,null,null,null,null,null,"Riêng công tác xây dựng trong đường hầm giao thông",6.5,{"$f":"BA33","v":7.3},"Định mức chi phí chung tính trên chi phí trực tiếp (C)"]
[null,7,"Code Level1",null,"HM","TB",null,null,null,null,null,null,null,6,"Thu gom, vận chuyển chất thải rắn sinh hoạt đô thị",null,null,null,null,"Công tác duy tu sửa chữa thường xuyên đường bộ, đường sắt, đường thủy nội địa, hệ thống báo hiệu hàng hải và đường thủy nội địa",2,{"$f":"AB$41","v":66},"Định mức chi phí chung tính trên chi phí nhân công (C)",null,null,null,null,null,null,null,"Công tác duy tu sửa chữa thường xuyên đường bộ, đường sắt, đường thủy nội địa, hệ thống báo hiệu hàng hải và đường thủy nội địa",2,{"$f":"AM$41","v":66},"Định mức chi phí chung tính trên chi phí nhân công (C)",null,null,null,null,null,null,null,"Duy tu sửa chữa đường bộ, đường sắt, hệ thống báo hiệu hàng hải",2,{"$f":"AY41","v":66},"Định mức chi phí chung tính trên chi phí nhân công (C)"]
[null,8,"Code Level2",null,"*",null,null,null,null,null,null,null,null,7,"Duy trì hệ thống chiếu sáng đô thị",null,null,null,4,"Công trình nông nghiệp và phát triển nông thôn",{"$f":"IFERROR(INDEX(U20:U21,$P$12,0),U20)","v":2},{"$f":"IFERROR(INDEX(V20:V21,$P$12,0),V20)","v":5.5},{"$f":"IFERROR(INDEX(W20:W21,$P$12,0),W20)","v":"Định mức chi phí chung tính trên chi phí trực tiếp (C)"},5.5,0.01,null,null,null,null,4,"Công trình nông nghiệp và phát triển nông thôn",{"$f":"IFERROR(INDEX(AF20:AF21,$P$12,0),AF20)","v":2},{"$f":"IFERROR(INDEX(AG20:AG21,$P$12,0),AG20)","v":6.1},{"$f":"IFERROR(INDEX(AH20:AH21,$P$12,0),AH20)","v":"Định mức chi phí chung tính trên chi phí trực tiếp (C)"},5.5,{"$f":"IF($K$16=1,$AM$48,$AM$49)/100","v":1.2E-2},null,null,null,null,4,"Công trình nông nghiệp và phát triển nông thôn",{"$f":"IFERROR(INDEX(AQ20:AQ22,$P$12,0),AQ20)","v":2},{"$f":"INDEX(AR20:AR22,$P$12,0)","v":6.1},{"$f":"IFERROR(INDEX(AS20:AS22,$P$12,0),AS20)","v":"Định mức chi phí chung tính trên chi phí trực tiếp (C)"},5.5,{"$f":"IF($K$16=1,$AX$48,$AX$49)/100","v":1.1000000000000001E-2}]
[null,9,"PhantichVua","Tùy theo bộ đơn giá",1,"1-Có 0-Không",null,null,null,null,null,null,null,8,"Duy trì, phát triển hệ thống cây xanh đô thị",null,null,null,null,"Thông thường",2,{"$f":"AB34","v":5.5},"Định mức chi phí chung tính trên chi phí trực tiếp (C)",null,null,null,null,null,null,null,"Thông thường",2,{"$f":"AM34","v":6.1},"Định mức chi phí chung tính trên chi phí trực tiếp (C)",null,null,null,null,null,null,null,"Thông thường",2,{"$f":"BA34","v":6.1},"Định mức chi phí chung tính trên chi phí trực tiếp (C)"]
[null,10,"Round",null,3,"Tham số mặc định",null,null,null,null,null,null,"Tham số",1,{"$f":"INDEX(O22:O23,N21)","v":"Dự án thường"},null,null,null,null,"Riêng công trình đường hầm",2,{"$f":"$AB$42","v":51},"Định mức chi phí chung tính trên chi phí nhân công (C)",null,null,null,null,null,null,null,"Công tác đào, đắp đất công trình nông nghiệp và phát triển nông thôn bằng thủ công",2,{"$f":"$AM$42","v":51},"Định mức chi phí chung tính trên chi phí nhân công (C)",null,null,null,null,null,null,null,"Riêng công trình đường hầm",6.5,{"$f":"BA35","v":7.3},"Định mức chi phí chung tính trên chi phí trực tiếp (C)"]
[null,null,null,null,null,null,null,null,"Nguyên giá tính giá trị thu hồi",30000000,null,null,"Loại công trình",1,"Dự án thường",null,null,null,null,"Công tác đào, đắp đất công trình nông nghiệp và phát triển nông thôn bằng thủ công",null,null,null,null,null,null,null,null,null,null,null,null,null,null,null,null,null,null,null,null,null,"Công trình nông nghiệp và phát triển nông thôn thực hiện hoàn toàn bằng thủ công",2,{"$f":"AY42","v":51},"Định mức chi phí chung tính trên chi phí nhân công (C)"]
[null,11,"CIRCULAR",null,"Chi phí Xây dựng | Phụ lục số 3 Thông tư 11/2021/TT-BXD","1-T04 2-TT06",null,null,"Tỷ lệ thu hồi khi thanh lý",0.1,null,null,null,2,"Dự án PPP",null,null,null,5,"Công trình hạ tầng kỹ thuật",{"$f":"U24","v":2},{"$f":"V24","v":5},{"$f":"W24","v":"Định mức chi phí chung tính trên chi phí trực tiếp (C)"},5.5,0.01,null,null,null,null,5,"Công trình hạ tầng kỹ thuật",{"$f":"AF24","v":2},{"$f":"AG24","v":5.5},{"$f":"AH24","v":"Định mức chi phí chung tính trên chi phí trực tiếp (C)"},5.5,{"$f":"IF($K$16=1,$AM$48,$AM$49)/100","v":1.2E-2},null,null,null,null,5,"Công trình hạ tầng kỹ thuật",{"$f":"AQ24","v":2},{"$f":"AR24","v":5.5},{"$f":"AS24","v":"Định mức chi phí chung tính trên chi phí trực tiếp (C)"},5.5,{"$f":"IF($K$16=1,$AX$48,$AX$49)/100","v":1.1000000000000001E-2}]
[null,12,"Tổng hợp toàn bộ",null,null,"1-Có 0-Không",null,null,null,null,null,null,null,null,null,null,null,null,null,"Thông thường",2,{"$f":"AB36","v":5},"Định mức chi phí chung tính trên chi phí trực tiếp (C)",null,null,null,null,null,null,null,"Thông thường",2,{"$f":"AM36","v":5.5},"Định mức chi phí chung tính trên chi phí trực tiếp (C)",null,null,null,null,null,null,null,"Thông thường",2,{"$f":"BA36","v":5.5},"Định mức chi phí chung tính trên chi phí trực tiếp (C)"]
[null,13,"Phương pháp lập dự toán (Method Estimation)",null,4,{"$f":"\"Đang sử dụng: \"&VLOOKUP(E25,N25:O29,2,0)","v":"Đang sử dụng: Theo đơn giá trực tiếp lập từ định mức và giá vật tư thời điểm"},null,null,null,null,null,null,"Phương pháp lập giá",1,"Theo đơn giá địa phương + chênh lệch (old)",null,null,null,"Bảng 3.7: ĐỊNH MỨC CHI PHÍ CHUNG TÍNH TRÊN CHI PHÍ TRỰC TIẾP",null,null,null,null,null,null,"Ga","Gb","Gt",null,"Bảng 3.7: ĐỊNH MỨC CHI PHÍ CHUNG TÍNH TRÊN CHI PHÍ TRỰC TIẾP",null,null,null,null,null,null,"Ga","Gb","Gt",null,"Bảng 3.1: ĐỊNH MỨC CHI PHÍ CHUNG TÍNH TRÊN CHI PHÍ TRỰC TIẾP",null,null,null,null,null,null,null,null,null,null,null,"Gt"]
[null,14,"Chi phí nhân công",null,2,{"$f":"IF(E26=1,\"Thông tư 15/2019/TT-BXD\",IF(E26=2,\"Thông tư 13/2021/TT-BXD\",\"Thông tư 05/2016/TT-BXD\"))","v":"Thông tư 13/2021/TT-BXD"},null,null,null,null,null,null,null,2,"Theo đơn giá địa phương + bù chênh lệch",null,null,null,"TT","Loại công trình","Chi phí XD trước thuế trong TMĐT xây dựng của DA được duyệt (tỷ đồng)",null,null,null,null,{"$f":"IF(AB26<=U27,U27,OFFSET(U27,0,MATCH(AB26,U27:Y27,1)-1))","v":15},{"$f":"IF(AB26<=15,U27,IF(AB26<1000,OFFSET(U27,0,MATCH(AB26,U27:Y27,1)),1000))","v":15},{"$f":"IFERROR('Dự toán XDCT'!$I$3/10^9,0)","v":0},null,"TT","Loại công trình","Chi phí trực tiếp của từng loại, từng nhóm công trình (tỷ đồng)",null,null,null,null,{"$f":"IF(AM26<=AF27,AF27,OFFSET(AF27,0,MATCH(AM26,AF27:AJ27,1)-1))","v":15},{"$f":"IF(AM26<=15,AF27,IF(AM26<1000,OFFSET(AF27,0,MATCH(AM26,AF27:AJ27,1)),1000))","v":15},{"$f":"IFERROR(_CPtructiep/10^9,0)","v":0},null,"TT","Loại công trình","Chi phí xây dựng trước thuế trong tổng mức đầu tư của dự án được duyệt (tỷ đồng)",null,null,null,null,null,null,null,null,null,{"$f":"IFERROR('Dự toán XDCT'!$I$3/10^9,0)","v":0}]
[null,15,"Chi phí giá ca máy",null,2,{"$f":"IF(E27=1,\"Sử dụng Giá ca máy gốc + Bù giá nhiên liệu, lương thợ lái máy\",IF(E27=2,\"Lập giá ca máy mới tại thời điểm lập dự toán, căn cứ Thông tư 13/2021/TT-BXD\",\"\"))","v":"Lập giá ca máy mới tại thời điểm lập dự toán, căn cứ Thông tư 13/2021/TT-BXD"},null,null,null,null,null,null,null,3,"Theo đơn giá địa phương + điều chỉnh hệ số và bù chênh lệch",null,null,null,null,null,15,100,500,1000,1000,"Ka","Kb","DMTL",null,null,null,15,100,500,1000,1000,"Ka","Kb","DMTL",null,null,null,15,50,100,300,500,750,1000,1000,null,null,"DMTL"]
[null,16,"Sheet chọn trước khi in",null,null,null,null,null,null,null,null,null,null,4,"Theo đơn giá trực tiếp lập từ định mức và giá vật tư thời điểm",null,null,null,1,"Công trình dân dụng",6.5,6,5.6,5.4,5.2,{"$f":"IF(AB26<=U27,U28,IF(AB26=1000,X28,OFFSET(U28,0,MATCH(AB26,U27:Y27,1)-1)))","v":6.5},{"$f":"IF(AB26<=U27,U28,IF(AB26=1000,X28,OFFSET(U28,0,MATCH(AB26,U27:Y27,1))))","v":6.5},{"$f":"TREND(Z28:AA28,Z26:AA26,AB26)","v":6.5},null,1,"Công trình dân dụng",7.3,6.7,6.2,6,5.8,{"$f":"IF(AM26<=AF27,AF28,IF(AM26=1000,AI28,OFFSET(AF28,0,MATCH(AM26,AF27:AJ27,1)-1)))","v":7.3},{"$f":"IF(AM26<=AF27,AF28,IF(AM26=1000,AI28,OFFSET(AF28,0,MATCH(AM26,AF27:AJ27,1))))","v":7.3},{"$f":"TREND(AK28:AL28,AK26:AL26,AM26)","v":7.3},null,1,"Công trình dân dụng",7.3,7.1,6.7,6.5,6.2,6.1,6,5.8,null,null,{"$f":"IF($BA$26<=15,$AQ28,IF($BA$26>1000,$AX28,INDEX($AR28:$AW28,1,MATCH($BA$26,$AQ$27:$AW$27))))","v":7.3}]
[null,17,"Tự động phân tích khi số kết quả = 1",null,0,"1 - Tự động; 0 - Xem form",null,null,null,null,null,null,null,null,null,null,null,null,null,"Riêng công trình tu bổ, phục hồi di tích lịch sử, văn hoá",10,9,8.6,8.4,8.1999999999999993,{"$f":"IF(AB26<=U$27,U29,IF(AB26=1000,X29,OFFSET(U29,0,MATCH(AB26,U27:Y27,1)-1)))","v":10},{"$f":"IF(AB26<=U$27,U29,IF(AB26=1000,X29,OFFSET(U29,0,MATCH(AB26,U27:Y27,1))))","v":10},{"$f":"TREND(Z29:AA29,Z26:AA26,AB26)","v":10},null,null,"Riêng công trình tu bổ, phục hồi di tích lịch sử, văn hoá",11.6,10.3,9.9,9.6,9.4,{"$f":"IF(AM26<=AF$27,AF29,IF(AM26=1000,AI29,OFFSET(AF29,0,MATCH(AM26,AF27:AJ27,1)-1)))","v":11.6},{"$f":"IF(AM26<=AF$27,AF29,IF(AM26=1000,AI29,OFFSET(AF29,0,MATCH(AM26,AF27:AJ27,1))))","v":11.6},{"$f":"TREND(AK29:AL29,AK26:AL26,AM26)","v":11.6},null,null,"Riêng công trình tu bổ, phục hồi di tích lịch sử, văn hoá",11.6,11.1,10.3,10.1,9.9,9.8000000000000007,9.6,9.4,null,null,{"$f":"IF($BA$26<=15,$AQ29,IF($BA$26>1000,$AX29,INDEX($AR29:$AW29,1,MATCH($BA$26,$AQ$27:$AW$27))))","v":11.6}]
[null,18,"Ký hiệu tiền tố Hạng mục",null,"HM",null,null,null,null,null,null,null,null,null,null,null,null,null,2,"Công trình công nghiệp",5.5,5,4.5999999999999996,4.4000000000000004,4.2,{"$f":"IF(AB26<=U$27,U30,IF(AB26=1000,X30,OFFSET(U30,0,MATCH(AB26,U27:Y27,1)-1)))","v":5.5},{"$f":"IF(AB26<=U$27,U30,IF(AB26=1000,X30,OFFSET(U30,0,MATCH(AB26,U27:Y27,1))))","v":5.5},{"$f":"TREND(Z30:AA30,Z26:AA26,AB26)","v":5.5},null,2,"Công trình công nghiệp",6.2,5.6,5,4.9000000000000004,4.5999999999999996,{"$f":"IF(AM26<=AF$27,AF30,IF(AM26=1000,AI30,OFFSET(AF30,0,MATCH(AM26,AF27:AJ27,1)-1)))","v":6.2},{"$f":"IF(AM26<=AF$27,AF30,IF(AM26=1000,AI30,OFFSET(AF30,0,MATCH(AM26,AF27:AJ27,1))))","v":6.2},{"$f":"TREND(AK30:AL30,AK26:AL26,AM26)","v":6.2},null,2,"Công trình công nghiệp",6.2,6,5.6,5.3,5,5,4.9000000000000004,4.5999999999999996,null,null,6.2]
[null,19,"Ký hiệu số hiệu đơn giá",null,"DG",null,null,null,null,null,null,null,"Lán trại",1,"Công trình theo tuyến",null,null,null,null,"Riêng công trình xây dựng đường hầm, hầm lò",6.5,6.3,6,5.8,5.7,{"$f":"IF(AB26<=U$27,U31,IF(AB26=1000,X31,OFFSET(U31,0,MATCH(AB26,U27:Y27,1)-1)))","v":6.5},{"$f":"IF(AB26<=U$27,U31,IF(AB26=1000,X31,OFFSET(U31,0,MATCH(AB26,U27:Y27,1))))","v":6.5},{"$f":"TREND(Z31:AA31,Z26:AA26,AB26)","v":6.5},null,null,"Riêng công trình xây dựng đường hầm, hầm lò",7.3,7.1,6.7,6.5,6.4,{"$f":"IF(AM26<=AF$27,AF31,IF(AM26=1000,AI31,OFFSET(AF31,0,MATCH(AM26,AF27:AJ27,1)-1)))","v":7.3},{"$f":"IF(AM26<=AF$27,AF31,IF(AM26=1000,AI31,OFFSET(AF31,0,MATCH(AM26,AF27:AJ27,1))))","v":7.3},{"$f":"TREND(AK31:AL31,AK26:AL26,AM26)","v":7.3},null,null,"Riêng công trình xây dựng đường hầm, hầm lò",7.3,7.2,7.1,6.9,6.7,6.6,6.5,6.4,null,null,7.3]
[null,20,"Sử dụng Đơn giá chi tiết",null,1,"1- Một đơn giá cho một công việc || 2 - Một đơn giá cho nhiều cv",null,null,null,null,null,null,null,2,"Công trình không theo tuyến",null,null,null,3,"Công trình giao thông",5.5,5,4.5999999999999996,4.4000000000000004,4.2,{"$f":"IF(AB26<=U$27,U32,IF(AB26=1000,X32,OFFSET(U32,0,MATCH(AB26,U27:Y27,1)-1)))","v":5.5},{"$f":"IF(AB26<=U$27,U32,IF(AB26=1000,X32,OFFSET(U32,0,MATCH(AB26,U27:Y27,1))))","v":5.5},{"$f":"TREND(Z32:AA32,Z26:AA26,AB26)","v":5.5},null,3,"Công trình giao thông",6.2,5.6,5.0999999999999996,4.9000000000000004,4.5999999999999996,{"$f":"IF(AM26<=AF$27,AF32,IF(AM26=1000,AI32,OFFSET(AF32,0,MATCH(AM26,AF27:AJ27,1)-1)))","v":6.2},{"$f":"IF(AM26<=AF$27,AF32,IF(AM26=1000,AI32,OFFSET(AF32,0,MATCH(AM26,AF27:AJ27,1))))","v":6.2},{"$f":"TREND(AK32:AL32,AK26:AL26,AM26)","v":6.2},null,3,"Công trình giao thông",6.2,6,5.6,5.3,5.0999999999999996,5,4.9000000000000004,4.5999999999999996,null,null,6.2]
[null,21,"Ký hiệu số hiệu hợp giá",null,"HG",null,null,null,null,null,null,null,null,null,null,null,null,null,null,"Riêng công trình hầm giao thông",6.5,6.3,6,5.8,5.7,{"$f":"IF(AB26<=U$27,U33,IF(AB26=1000,X33,OFFSET(U33,0,MATCH(AB26,U27:Y27,1)-1)))","v":6.5},{"$f":"IF(AB26<=U$27,U33,IF(AB26=1000,X33,OFFSET(U33,0,MATCH(AB26,U27:Y27,1))))","v":6.5},{"$f":"TREND(Z33:AA33,Z26:AA26,AB26)","v":6.5},null,null,"Riêng công trình hầm giao thông",7.3,7.1,6.7,6.5,6.4,{"$f":"IF(AM26<=AF$27,AF33,IF(AM26=1000,AI33,OFFSET(AF33,0,MATCH(AM26,AF27:AJ27,1)-1)))","v":7.3},{"$f":"IF(AM26<=AF$27,AF33,IF(AM26=1000,AI33,OFFSET(AF33,0,MATCH(AM26,AF27:AJ27,1))))","v":7.3},{"$f":"TREND(AK33:AL33,AK26:AL26,AM26)","v":7.3},null,null,"Riêng công trình hầm giao thông",7.3,7.2,7.1,6.9,6.7,6.6,6.5,6.4,null,null,7.3]
[null,22,"Sử dụng đơn giá đầy đủ:",null,0,"1 - Đầy đủ; 0 - Không đầy đủ",null,null,null,null,null,null,null,null,null,null,null,null,4,"Công trình nông nghiệp và phát triển nông thôn",5.5,5,4.5999999999999996,4.4000000000000004,4.2,{"$f":"IF(AB26<=U$27,U34,IF(AB26=1000,X34,OFFSET(U34,0,MATCH(AB26,U27:Y27,1)-1)))","v":5.5},{"$f":"IF(AB26<=U$27,U34,IF(AB26=1000,X34,OFFSET(U34,0,MATCH(AB26,U27:Y27,1))))","v":5.5},{"$f":"TREND(Z34:AA34,Z26:AA26,AB26)","v":5.5},null,4,"Công trình nông nghiệp và phát triển nông thôn",6.1,5.5,5.0999999999999996,4.8,4.5999999999999996,{"$f":"IF(AM26<=AF$27,AF34,IF(AM26=1000,AI34,OFFSET(AF34,0,MATCH(AM26,AF27:AJ27,1)-1)))","v":6.1},{"$f":"IF(AM26<=AF$27,AF34,IF(AM26=1000,AI34,OFFSET(AF34,0,MATCH(AM26,AF27:AJ27,1))))","v":6.1},{"$f":"TREND(AK34:AL34,AK26:AL26,AM26)","v":6.1},null,4,"Công trình nông nghiệp và phát triển nông thôn",6.1,5.9,5.5,5.3,5.0999999999999996,5,4.8,4.5999999999999996,null,null,6.1]
[null,23,"Ký tự bắt đầu mã Công tác khối lượng",null,"CT",null,null,null,null,null,null,null,null,null,null,null,null,null,null,null,null,null,null,null,null,null,null,null,null,null,null,null,null,null,null,null,null,null,null,null,null,"Riêng công trình đường hầm",7.3,7.2,7.1,6.9,6.7,6.6,6.5,6.4,null,null,7.3]
[null,24,"Ẩn/ Hiện chi phí đuôi",null,1,null,null,null,null,null,null,null,null,null,null,null,null,null,5,"Công trình hạ tầng kỹ thuật",5,5,4.0999999999999996,3.9,3.7,{"$f":"IF(AB26<=U$27,U36,IF(AB26=1000,X36,OFFSET(U36,0,MATCH(AB26,U27:Y27,1)-1)))","v":5},{"$f":"IF(AB26<=U$27,U36,IF(AB26=1000,X36,OFFSET(U36,0,MATCH(AB26,U27:Y27,1))))","v":5},{"$f":"TREND(Z36:AA36,Z26:AA26,AB26)","v":5},null,5,"Công trình hạ tầng kỹ thuật",5.5,5,4.5,4.3,4,{"$f":"IF(AM26<=AF$27,AF36,IF(AM26=1000,AI36,OFFSET(AF36,0,MATCH(AM26,AF27:AJ27,1)-1)))","v":5.5},{"$f":"IF(AM26<=AF$27,AF36,IF(AM26=1000,AI36,OFFSET(AF36,0,MATCH(AM26,AF27:AJ27,1))))","v":5.5},{"$f":"TREND(AK36:AL36,AK26:AL26,AM26)","v":5.5},null,5,"Công trình hạ tầng kỹ thuật",5.5,5.3,5,4.8,4.5,4.4000000000000004,4.3,4,null,null,5.5]
[null,25,"Hệ số tính KL hao phí khác sheet PTVT",null,0,null,null,null,null,null,null,null,null,null,null,null,null,null,"Bảng 3.8: ĐỊNH MỨC CHI PHÍ CHUNG TÍNH TRÊN CHI PHÍ NHÂN CÔNG"]
[null,26,"Tra lại tên công việc",null,1,null,null,null,null,null,null,null,null,null,null,null,null,null,null,null,null,null,null,null,null,"Ga","Gb","Gt",null,"Bảng 3.8: ĐỊNH MỨC CHI PHÍ CHUNG TÍNH TRÊN CHI PHÍ NHÂN CÔNG",null,null,null,null,null,null,"Ga","Gb","Gt",null,"Bảng 3.2: ĐỊNH MỨC CHI PHÍ CHUNG TÍNH TRÊN CHI PHÍ NHÂN CÔNG",null,null,null,null,null,null,null,null,null,"Gt"]
[null,27,null,null,null,null,null,null,null,null,null,null,null,null,null,null,null,null,"TT","Loại công tác","Chi phí nhân công trong chi phí trực tiếp (tỷ đồng)",null,null,null,null,{"$f":"IF(AB39<100,15,100)","v":15},{"$f":"IF(AB39>15,100,15)","v":15},{"$f":"IFERROR(_CPnhancong/10^9,0)","v":0},null,"TT","Loại công tác","Chi phí nhân công trong chi phí trực tiếp (tỷ đồng)",null,null,null,null,{"$f":"IF(AM39<100,15,100)","v":15},{"$f":"IF(AM39>15,100,15)","v":15},{"$f":"IFERROR(_CPnhancong/10^9,0)","v":0},null,"TT","Loại công tác","Chi phí nhân công trong chi phí trực tiếp của dự toán xây dựng, lắp đặt của công trình (tỷ đồng)",null,null,null,null,null,null,null,{"$f":"IFERROR(_CPnhancong/10^9,0)","v":0}]
[null,28,"Link đơn giá trước thuế sang bảng Dự toán",null,0,null,null,null,null,null,null,null,null,null,null,null,null,null,null,null,15,100,100,null,null,"Ka","Kb","DMTL",null,null,null,15,100,100,null,null,"Ka","Kb","DMTL",null,null,null,15,50,100,100,null,null,null,null,"DMTL"]
[null,29,"Check đã phân tích đủ HM THVT chưa",{"$f":"COUNTIF('Dự toán'!$B$8:$B$26,$E$30)","v":0},{"$f":"COUNTIF('Tổng hợp vật tư'!$C$10:$C$97,$E$17&\"*\")","v":0},null,null,null,null,null,null,null,null,null,null,null,null,null,1,"Công tác duy tu sửa chữa đường bộ, đường sắt, đường thuỷ nội địa, hệ thống báo hiệu hàng hải và đường thuỷ nội địa",66,60,56,null,null,{"$f":"IF(AB39<100,U41,IF(AB39=100,V41,W41))","v":66},{"$f":"IF(AND(AB39>15,AB39<=100),V41,IF(AB39<=15,U41,W41))","v":66},{"$f":"TREND(Z41:AA41,Z39:AA39,AB39)","v":66},null,1,"Công tác duy tu sửa chữa đường bộ, đường sắt, đường thuỷ nội địa, hệ thống báo hiệu hàng hải và đường thuỷ nội địa",66,60,56,null,null,{"$f":"IF(AM39<100,AF41,IF(AM39=100,AG41,AH41))","v":66},{"$f":"IF(AND(AM39>15,AM39<=100),AG41,IF(AM39<=15,AF41,AH41))","v":66},{"$f":"TREND(AK41:AL41,AK39:AL39,AM39)","v":66},null,1,"Duy tu sửa chữa đường bộ, đường sắt, hệ thống báo hiệu hàng hải",66,63,60,56,null,null,null,null,{"$f":"IF($AY$39<=15,$AQ41,IF($AY$39>100,$AT41,INDEX($AR41:$AS41,1,MATCH($AY$39,$AQ$40:$AS$40))))","v":66}]
[null,null,null,null,null,null,null,null,null,null,null,null,null,null,null,null,null,null,2,"Công tác đào, đắp đất công trình nông nghiệp và phát triển nông thôn hoàn toàn bằng thủ công",51,45,42,null,null,{"$f":"IF(AB39<100,U42,IF(AB39=100,V42,W42))","v":51},{"$f":"IF(AND(AB39>15,AB39<=100),V42,IF(AB39<=15,U42,W42))","v":51},{"$f":"TREND(Z42:AA42,Z39:AA39,AB39)","v":51},null,2,"Công tác đào, đắp đất công trình nông nghiệp và phát triển nông thôn hoàn toàn bằng thủ công",51,45,42,null,null,{"$f":"IF(AM39<100,AF42,IF(AM39=100,AG42,AH42))","v":51},{"$f":"IF(AND(AM39>15,AM39<=100),AG42,IF(AM39<=15,AF42,AH42))","v":51},{"$f":"TREND(AK42:AL42,AK39:AL39,AM39)","v":51},null,2,"Công trình nông nghiệp và phát triển nông thôn thực hiện hoàn toàn bằng thủ công",51,48,45,42,null,null,null,null,{"$f":"IF($AY$39<=15,$AQ42,IF($AY$39>100,$AT42,INDEX($AR42:$AS42,1,MATCH($AY$39,$AQ$40:$AS$40))))","v":51}]
[null,null,null,null,null,null,null,null,null,null,null,null,null,null,null,null,null,null,3,"Công tác lắp đặt thiết bị công nghệ trong các công trình xây dựng, công tác xây lắp đường dây, thí nghiệm hiệu chỉnh điện đường dây và trạm biến áp, thí nghiệm vật liệu, cấu kiện và kết cấu xây dựng",65,59,55,null,null,{"$f":"IF(AB39<100,U43,IF(AB39=100,V43,W43))","v":65},{"$f":"IF(AND(AB39>15,AB39<=100),V43,IF(AB39<=15,U43,W43))","v":65},{"$f":"TREND(Z43:AA43,Z39:AA39,AB39)","v":65},null,3,"Công tác lắp đặt thiết bị công nghệ trong các công trình xây dựng, công tác xây lắp đường dây, thí nghiệm hiệu chỉnh điện đường dây và trạm biến áp, thí nghiệm vật liệu, cấu kiện và kết cấu xây dựng",65,59,55,null,null,{"$f":"IF(AM39<100,AF43,IF(AM39=100,AG43,AH43))","v":65},{"$f":"IF(AND(AM39>15,AM39<=100),AG43,IF(AM39<=15,AF43,AH43))","v":65},{"$f":"TREND(AK43:AL43,AK39:AL39,AM39)","v":65},null,3,"Lắp đặt thiết bị công nghệ trong các công trình xây dựng; xây dựng và lắp đặt đường dây tải điện; lắp đặt trạm biến áp; thí nghiệm hiệu chỉnh điện đường dây và trạm biến áp; thí nghiệm vật liệu, cấu kiện và kết cấu xây dựng",65,62,59,55,null,null,null,null,65]
[]
[null,null,null,null,null,null,null,null,null,null,null,null,null,null,null,null,null,null,null,null,null,null,null,null,null,null,null,null,null,"Bảng 3.9: ĐỊNH MỨC CHI PHÍ NHÀ TẠM ĐỂ Ở VÀ ĐIỀU HÀNH THI CÔNG",null,null,null,null,null,null,null,null,"Gt",null,"Bảng 3.4: ĐỊNH MỨC CHI PHÍ NHÀ TẠM ĐỂ Ở VÀ ĐIỀU HÀNH THI CÔNG"]
[null,null,null,null,null,null,null,null,null,null,null,null,null,null,null,null,null,null,null,null,null,null,null,null,null,null,null,null,null,"TT","Loại công trình","Chi phí trực tiếp của từng loại, từng nhóm công trình (tỷ đồng)",null,null,null,null,null,null,{"$f":"IFERROR(_CPtructiep/10^9,0)","v":0},null,"TT","Loại công trình","Chi phí xây dựng trước thuế trong tổng mức đầu tư của dự án được duyệt (tỷ đồng)"]
[null,null,null,null,null,null,null,null,null,null,null,null,null,null,null,null,null,null,null,null,null,null,null,null,null,null,null,null,null,null,null,15,100,500,1000,1000,null,null,"DMTL",null,null,null,15,100,500,1000,1000,null,null,"DMTL"]
[null,null,null,null,null,null,null,null,null,null,null,null,null,null,null,null,null,null,null,null,null,null,null,null,null,null,null,null,null,1,"Công trình xây dựng theo tuyến",2.2999999999999998,2.2000000000000002,2,1.9,1.8,null,null,{"$f":"IFERROR(IF($AM$46<=$AF$47,AF48,IF(AND($AM$46>$AF$47,$AM$46<=$AG$47),AG48,IF(AND($AM$46>$AG$47,$AM$46<=$AH$47),AH48,IF(AND($AM$46>$AH$47,$AM$46<=$AI$47),AI48,AJ48)))),AF48)","v":2.2999999999999998},null,1,"Công trình xây dựng theo tuyến",2.2000000000000002,2,1.9,1.8,1.7,null,null,{"$f":"IF($BA$26<=15,$AQ48,IF($BA$26>1000,$AU48,INDEX($AR48:$AT48,1,MATCH($BA$26,$AQ$47:$AT$47))))","v":2.2000000000000002}]
[null,null,null,null,null,null,null,null,null,null,null,null,null,null,null,null,null,null,null,null,null,null,null,null,null,null,null,null,null,2,"Công trình xây dựng còn lại ",1.2,1.1000000000000001,1,0.95,0.9,null,null,{"$f":"IFERROR(IF($AM$46<=$AF$47,AF49,IF(AND($AM$46>$AF$47,$AM$46<=$AG$47),AG49,IF(AND($AM$46>$AG$47,$AM$46<=$AH$47),AH49,IF(AND($AM$46>$AH$47,$AM$46<=$AI$47),AI49,AJ49)))),AF49)","v":1.2},null,2,"Công trình xây dựng còn lại ",1.1000000000000001,1,0.95,0.9,0.85,null,null,{"$f":"IF($BA$26<=15,$AQ49,IF($BA$26>1000,$AU49,INDEX($AR49:$AT49,1,MATCH($BA$26,$AQ$47:$AT$47))))","v":1.1000000000000001}]
[null,null,"Using XDA Construction Cost Estimating Data"]
[null,1,"001_DinhMucXDCB-2021"]
[null,2]
[null,3]
[null,4]
[null,5]

{"sheet":"Dự toán XDCT","index":6,"n_rows":40,"n_cols":12,"rows_kept":40,"cut":false,"hidden":true,"merged":[]}
[null,null,"Loại dự án :",null,null,null,"Loại báo cáo: ","Loại báo cáo:"]
[null,null,"Loại công trình : ",null,null,null,null,{"$f":"IF(AND(GD_=3,LBC_<3),\"TMĐT được duyệt : \",\"TMĐT GIẢ ĐỊNH ĐỂ TÍNH CP NỘI SUY THEO TMĐT\")","v":"TMĐT được duyệt : "},null,"đồng"]
[null,null,"Cấp công trình : ",null,null,{"$f":"IF(AND(BTK_=1,LBC_<=2),IF(LBC_=1,\"Báo cáo NC tiền khả thi không thể chỉ có 1 bước. Chọn lại số bước thiết kế hoặc Loại báo cáo.\",\"Báo cáo NC khả thi không thể chỉ có 1 bước. Chọn lại số bước thiết kế hoặc Loại báo cáo.\"),IF(AND(LBC_=3,BTK_>1),\"Chọn lại số bước thiết kế hoặc Loại báo cáo\",\"\"))","v":""},null,{"$f":"IF(AND(GD_=3,LBC_<3),\"Gxd trước thuế trong TMĐT : \",\"\")","v":"Gxd trước thuế trong TMĐT : "},{"$f":"Info!$D$11","v":0},"đồng"]
[null,null,"Số bước thiết kế : ",null,{"$f":"IF(AND(LBC_=3,GD_<=2),\"Chọn lại Loại báo cáo hoặc Giai đoạn tính toán.\",\"\")","v":""},null,null,{"$f":"IF(AND(GD_=3,LBC_<3),\"Gtb trước thuế trong TMĐT : \",\"\")","v":"Gtb trước thuế trong TMĐT : "},null,"đồng"]
[null,null,"Giai đoạn tính toán : "]
["(BẢNG 2.1 - Theo Thông tư số 11/2021/TT-BXD ngày 31/08/2021 của Bộ trưởng Bộ Xây dựng)"]
["TỔNG HỢP DỰ TOÁN XÂY DỰNG CÔNG TRÌNH"]
[null,null,{"$f":"\"Dự án: \"&Info!$D$5","v":"Dự án: Dự án đầu tư xây dựng công trình …"}]
[null,null,{"$f":"\"Công trình: \" &Info!$D$6","v":"Công trình: Công trình xây dựng …"}]
[null,null,"Thời điểm lập dự toán (ngày / tháng / năm): ….../...../20…"]
[null,null,null,null,null,null,null,null,"Đơn vị tính: đồng"]
["STT","Mã CP","NỘI DUNG CHI PHÍ","Định mức tỷ lệ %","HỆ SỐ","CÁCH TÍNH","GIÁ TRỊ TRƯỚC THUẾ","THUẾ GTGT","GIÁ TRỊ SAU THUẾ","Ký hiệu","Cơ sở pháp lý"]
[{"$f":"IF(GD_<3,1,0)","v":0},null,"Chi phí bồi thường, hỗ trợ và tái định cư",null,null,"Bảng tính riêng",null,{"$f":"G13*0.1","v":0},{"$f":"SUM(G13:H13)","v":0},"GBT,TĐC"]
[{"$f":"IF(A13<>\"\",A13+1,1)","v":1},"XD","Chi phí xây dựng",null,null,null,{"$f":"SUM(G15:G16)","v":0},{"$f":"SUM(H15:H16)","v":0},{"$f":"SUM(I15:I16)","v":0},"GXD"]
[null,null,"Chi phí xây dựng công trình chính",null,null,null,{"$f":"I15/1.1","v":0},{"$f":"10%*G15","v":0},{"$f":"'Tổng hợp CPXD'!$E$29","v":0}]
[]
[{"$f":"A14+1","v":2},"TB","Chi phí thiết bị",null,null,null,{"$f":"'Tổng hợp CPTB'!$E$24","v":0},{"$f":"10%*G17","v":0},{"$f":"SUM(G17:H17)","v":0},"GTB"]
[null,null,"Chi phí thiết bị công trình",null,null,null,{"$f":"'Tổng hợp CPTB'!$E$23","v":0},{"$f":"'Tổng hợp CPTB'!$F$23","v":0},{"$f":"'Tổng hợp CPTB'!$G$23","v":0}]
[{"$f":"A17+1","v":3},"QLDA","Chi phí quản lý dự án",{"$f":"Data!I4","v":3.4460000000000002},null,"(Gxd+Gtb)*ĐMTL",{"$f":"Data!K4","v":0},null,{"$f":"Data!M4","v":0},"GQLDA","Thông tư 12/2021/TT-BXD ngày 31/08/2021 của Bộ Xây dựng",{"$f":"IF(AND(GD_=3,LBC_<3),\"Chú ý so sánh với ĐMTL giai đoạn trước\",\"\")","v":"Chú ý so sánh với ĐMTL giai đoạn trước"}]
[null,null,{"$f":"IF(Data!$AU$125>1,\"Chi phí hoạt động của đơn vị QLDA thuộc CQNN\",\"\")","v":""},{"$f":"IF(Data!$AU$125>1,Data!$I$5,0)","v":0},null,{"$f":"IF(Data!$AU$125>1,\"(Gxd+Gtb)*ĐMTL\",\"\")","v":""},{"$f":"(G17+G14)*D20%","v":0},{"$f":"G20*0.1","v":0},{"$f":"G20+H20","v":0},{"$f":"IF(Data!$AU$125>1,\"GQLDA-PPP\",\"\")","v":""}]
[{"$f":"A19+1","v":4},"TV","Chi phí tư vấn đầu tư xây dựng",null,null,null,{"$f":"SUM(G22:G24)","v":0},{"$f":"SUM(H22:H24)","v":0},{"$f":"SUM(I22:I24)","v":0},"GTV"]
[]
[]
[]
[{"$f":"A21+1","v":5},"CPK","Chi phí khác",null,null,null,{"$f":"SUM(G26:G29)","v":0},{"$f":"SUM(H26:H29)","v":0},{"$f":"SUM(I26:I29)","v":0},"GK"]
[]
[]
[]
[]
[{"$f":"A25+1","v":6},"CPDP","Chi phí dự phòng  (GDP1 + GDP2)",null,null,null,{"$f":"SUM(G31:G32)","v":0},{"$f":"SUM(H31:H32)","v":0},{"$f":"SUM(I31:I32)","v":0},"GDP"]
[{"$f":"IF(C31<>\"\",$A$30&\".\"&COUNTA($C$31:C31),\"\")","v":"6.1"},null,"Chi phí dự phòng cho yếu tố khối lượng công việc phát sinh",null,null,null,{"$f":"I31/1.1","v":0},{"$f":"I31*0.1","v":0},{"$f":"'CP Dự phòng'!E4","v":0},"GDP1"]
[{"$f":"IF(C32<>\"\",$A$30&\".\"&COUNTA($C$31:C32),\"\")","v":"6.2"},null,"Chi phí dự phòng cho yếu tố trượt giá",null,null,null,{"$f":"I32/1.1","v":0},{"$f":"G32*0.1","v":0},{"$f":"'CP Dự phòng'!G32","v":0},"GDP2"]
[null,null,{"$f":"IF(GD_<3,\"TỔNG CỘNG (1+ 2 + 3 + 4 + 5 + 6 +7)\",\"TỔNG CỘNG (1+ 2 + 3 + 4 + 5+ 6)\")","v":"TỔNG CỘNG (1+ 2 + 3 + 4 + 5+ 6)"},null,null,null,{"$f":"G13+G14+G17+G19+G21+G25+G30","v":0},{"$f":"H13+H14+H17+H19+H21+H25+H30","v":0},{"$f":"I13+I14+I17+I19+I21+I25+I30","v":0},{"$f":"IF(GD_<3,\"Vtm\",\"Gxdct\")","v":"Gxdct"}]
[]
[null,null,"NGƯỜI LẬP",null,null,null,null,null,"NGƯỜI CHỦ TRÌ"]
[null,null,"(ký, họ tên)",null,null,null,null,null,"(ký, họ tên)"]
[]
[]
[]
[null,null,null,null,null,null,null,null,"Chứng chỉ hành nghề định giá XD hạng ..…, số……………………"]

{"sheet":"Data","index":7,"n_rows":437,"n_cols":51,"rows_kept":437,"cut":false,"hidden":true,"merged":[[278,32,279,32],[278,33,278,40],[209,31,210,31],[209,32,210,32],[209,35,209,39],[240,32,241,32],[240,33,240,34],[270,32,271,32],[270,33,270,40]]}
["BẢNG TỔNG HỢP CÁC KHOẢN CHI PHÍ"]
[]
["TT","Mã","NỘI DUNG KHOẢN MỤC CHI PHÍ","Ga","Gb","Na","Nb","Gt","ĐMTL (%)","Hệ số","TT trước VAT","VAT","Thành tiền",null,null,null,"ĐƯA SANG","Hiển thị khi đưa sang"]
[1,"QLDA","Chi phí quản lý dự án",{"$f":"IF($H4<=MIN($T$130:$AE$130),MIN($T$130:$AE$130),LOOKUP($H4,$T$130:$AE$130))","v":10},{"$f":"IF($H4<=MIN($T$130:$AE$130),$D4,INDEX($T$130:$AE$130,0,IF($H4>=MAX($T$130:$AE$130),MATCH($D4,$T$130:$AE$130,0),MATCH($D4,$T$130:$AE$130,0)+1)))","v":10},{"$f":"HLOOKUP($D4,QLDA_,LCT_+1,0)","v":3.4460000000000002},{"$f":"HLOOKUP($E4,QLDA_,LCT_+1,0)","v":3.4460000000000002},{"$f":"IF(AND(GD_=3,LBC_<=2),XDTB_TM,XD_TB)","v":0},{"$f":"IF($D4=$E4,$F4,FORECAST(IF(AND(GD_=3,LBC_<=2),XDTB_TM,XD_TB),$F4:$G4,$D4:$E4))","v":3.4460000000000002},{"$f":"'Dự toán XDCT'!E19","v":0},{"$f":"IF(J4<>0,XD_TB*I4*J4*10^7,XD_TB*I4*10^7)","v":0},null,{"$f":"K4+L4","v":0}]
["1.1","QLDA_PPP","Chi phí hoạt động của đơn vị quản lý dự án thuộc Cơ quan nhà nước có thẩm quyền thực hiện dự án theo hình thức đối tác công tư (PPP)",{"$f":"IF($H5<=MIN($T$140:$AC$140),MIN($T$140:$AC$140),LOOKUP($H5,$T$140:$AC$140))","v":50},{"$f":"IF($H5<=MIN($T$140:$AC$140),$D5,INDEX($T$140:$AC$140,0,IF($H5>=MAX($T$140:$AC$140),MATCH($D5,$T$140:$AC$140,0),MATCH($D5,$T$140:$AC$140,0)+1)))","v":50},{"$f":"HLOOKUP($D5,QLDA_PPP,LCT_+1,0)","v":1.113},{"$f":"HLOOKUP($E5,QLDA_PPP,LCT_+1,0)","v":1.113},{"$f":"IF(AND(GD_=3,LBC_<=2),XDTB_TM,XD_TB)","v":0},{"$f":"IF($D5=$E5,$F5,FORECAST(IF(AND(GD_=3,LBC_<=2),XDTB_TM,XD_TB),$F5:$G5,$D5:$E5))","v":1.113},null,null,null,null,null,null,null,null,{"$f":"IF(Q5=\"TRUE\",\"Gxd+Gtb)*ĐMTL\",\"\")","v":""}]
[2,"TVBCDXCT","Chi phí lập báo cáo đề xuất chủ trương đầu tư"]
[3,"TVLQHCT","Chi phí lập quy hoạch chi tiết 1/500"]
[4,"TVKSXD-TM","Chi phí khảo sát xây dựng (bước lập báo cáo nghiên cứu khả thi)"]
[5,"TVGSKS-TM-1","Chi phí giám sát công tác khảo sát xây dựng (bước lập báo cáo nghiên cứu khả thi)",{"$f":"IF(H9<=MIN($T$367:$X$367),MIN($T$367:$X$367),LOOKUP(H9,$T$367:$X$367))","v":1},{"$f":"IF(H9<=MIN($T$367:$X$367),$D9,INDEX($T$367:$X$367,0,IF(H9>=MAX($T$367:$X$367),MATCH($D9,$T$367:$X$367,0),MATCH($D9,$T$367:$X$367,0)+1)))","v":1},{"$f":"HLOOKUP(D9,Data_GSKS,2,0)","v":4.0720000000000001},{"$f":"HLOOKUP(E9,Data_GSKS,2,0)","v":4.0720000000000001},null,{"$f":"IF($D9=$E9,$F9,FORECAST(GTKS_,$F9:$G9,$D9:$E9))","v":4.0720000000000001},null,{"$f":"IF(J9<>0,H9*I9*J9*10^7,H9*I9*10^7)","v":0},{"$f":"0.1*K9","v":0},{"$f":"SUM(K9:L9)","v":0}]
[6,"TVTTTCKT","Chi phí thi tuyển, tuyển chọn thiết kế kiến trúc công trình xây dựng"]
[7,"TVDGTDMT","Chi phí lập báo cáo đánh giá tác động môi trường (ĐTM)"]
[8,"TVBCNCTKT","Chi phí lập báo cáo nghiên cứu tiền khả thi",{"$f":"IF(H12<=MIN($T$150:$AE$150),MIN($T$150:$AE$150),LOOKUP(H12,$T$150:$AE$150))","v":15},{"$f":"IF(H12<=MIN($T$150:$AE$150),$D12,INDEX($T$150:$AE$150,0,IF(H12>=MAX($T$150:$AE$150),MATCH($D12,$T$150:$AE$150,0),MATCH($D12,$T$150:$AE$150,0)+1)))","v":15},{"$f":"HLOOKUP($D12,Data_BCTKT,LCT_+1,0)","v":0.66800000000000004},{"$f":"HLOOKUP($E12,Data_BCTKT,LCT_+1,0)","v":0.66800000000000004},{"$f":"IF(GD_>=2,0,XD_TB)","v":0},{"$f":"IF($D12=$E12,$F12,FORECAST(XD_TB,$F12:$G12,$D12:$E12))","v":0.66800000000000004},null,{"$f":"IF(J12<>0,H12*I12*J12*10^7,H12*I12*10^7)","v":0},{"$f":"K12*10%","v":0},{"$f":"K12+L12","v":0},null,null,null,{"$f":"IF(LBC_=1,\"TRUE\")","v":false},{"$f":"IF(LBC_=1,\"Hợp đồng đã ký\",\"\")","v":""}]
[9,"TVBCNCKT","Chi phí lập báo cáo nghiên cứu khả thi",{"$f":"IF(H13<=MIN($T$150:$AE$150),MIN($T$150:$AE$150),LOOKUP(H13,$T$150:$AE$150))","v":15},{"$f":"IF(H13<=MIN($T$150:$AE$150),$D13,INDEX($T$150:$AE$150,0,IF(H13>=MAX($T$150:$AE$150),MATCH($D13,$T$150:$AE$150,0),MATCH($D13,$T$150:$AE$150,0)+1)))","v":15},{"$f":"HLOOKUP($D13,Data_BCKT,LCT_+1,0)","v":1.1140000000000001},{"$f":"HLOOKUP($E13,Data_BCKT,LCT_+1,0)","v":1.1140000000000001},{"$f":"IF(GD_=3,0,XD_TB)","v":0},{"$f":"IF($D13=$E13,$F13,FORECAST(XD_TB,$F13:$G13,$D13:$E13))","v":1.1140000000000001},null,{"$f":"IF(J13<>0,H13*I13*J13*10^7,H13*I13*10^7)","v":0},{"$f":"K13*10%","v":0},{"$f":"K13+L13","v":0},null,null,null,{"$f":"IF(LBC_<=2,\"TRUE\")","v":"TRUE"},{"$f":"IF(GD_=3,\"Hợp đồng đã ký\",\"\")","v":"Hợp đồng đã ký"}]
[10,"TVGSDGDA","Chi phí giám sát, đánh giá dự án đầu tư xây dựng công trình (trường hợp thuê tư vấn)"]
[11,"TVBIM","Chi phí ứng dụng hệ thống thông tin công trình"]
[12,"TVQTGSMT","Chi phí tư vấn quan trắc và giám sát môi trường"]
[13,"TVBCKTKT","Chi phí lập báo cáo kinh tế - kỹ thuật",{"$f":"IF(H17<=MIN($T$170:$W$170),MIN($T$170:$W$170),LOOKUP(H17,$T$170:$W$170))","v":1},{"$f":"IF(H17<=MIN($T$170:$W$170),$D17,INDEX($T$170:$W$170,0,IF(H17>=MAX($T$170:$W$170),MATCH($D17,$T$170:$W$170,0),MATCH($D17,$T$170:$W$170,0)+1)))","v":1},{"$f":"HLOOKUP($D17,Data_BCKTKT,LCT_+1,0)","v":6.5},{"$f":"HLOOKUP($E17,Data_BCKTKT,LCT_+1,0)","v":6.5},{"$f":"IF(LBC_=3,XD_TB,0)","v":0},{"$f":"IF($D17=$E17,$F17,FORECAST(XD_TB,$F17:$G17,$D17:$E17))","v":6.5},null,{"$f":"IF(IF(J17<>0,H17*I17*J17*10^7,H17*I17*10^7)>5000000,IF(J17<>0,H17*I17*J17*10^7,H17*I17*10^7),5000000)","v":5000000},{"$f":"K17*10%","v":500000},{"$f":"K17+L17","v":5500000},null,null,null,{"$f":"IF(LBC_=3,\"TRUE\")","v":false},{"$f":"IF(K17>5000000,\"\",\"Tối thiểu không nhỏ hơn 5.000.000 đồng\")","v":"Tối thiểu không nhỏ hơn 5.000.000 đồng"}]
[14,"TVDCBCTKT","Chi phí điều chỉnh báo cáo nghiên cứu tiền khả thi"]
[15,"TVDCBCKT","Chi phí điều chỉnh báo cáo nghiên cứu khả thi"]
[16,"TVDCBCKTKT","Chi phí điều chỉnh báo cáo kinh tế - kỹ thuật"]
[17,"TVTTrBCNCTKT","Chi phí thẩm tra báo cáo nghiên cứu tiền khả thi",{"$f":"IF(H21<=MIN($T$150:$AE$150),MIN($T$150:$AE$150),LOOKUP(H21,$T$150:$AE$150))","v":15},{"$f":"IF(H21<=MIN($T$150:$AE$150),$D21,INDEX($T$150:$AE$150,0,IF(H21>=MAX($T$150:$AE$150),MATCH($D21,$T$150:$AE$150,0),MATCH($D21,$T$150:$AE$150,0)+1)))","v":15},{"$f":"HLOOKUP($D21,TTrTKT_,LCT_+1,0)","v":7.0999999999999994E-2},{"$f":"HLOOKUP($E21,TTrTKT_,LCT_+1,0)","v":7.0999999999999994E-2},{"$f":"IF(GD_>=2,0,XD_TB)","v":0},{"$f":"IF($D21=$E21,$F21,FORECAST(XD_TB,$F21:$G21,$D21:$E21))","v":7.0999999999999994E-2},null,{"$f":"IF(J21<>0,H21*I21*J21*10^7,H21*I21*10^7)","v":0},{"$f":"K21*10%","v":0},{"$f":"K21+L21","v":0},null,null,null,{"$f":"IF(LBC_=1,\"TRUE\")","v":false},{"$f":"IF(GD_>=2,\"Hợp đồng đã ký\",\"\")","v":"Hợp đồng đã ký"}]
[18,"TVTTrBCNCKT","Chi phí thẩm tra báo cáo nghiên cứu khả thi",{"$f":"IF(H22<=MIN($T$150:$AE$150),MIN($T$150:$AE$150),LOOKUP(H22,$T$150:$AE$150))","v":15},{"$f":"IF(H22<=MIN($T$150:$AE$150),$D22,INDEX($T$150:$AE$150,0,IF(H22>=MAX($T$150:$AE$150),MATCH($D22,$T$150:$AE$150,0),MATCH($D22,$T$150:$AE$150,0)+1)))","v":15},{"$f":"HLOOKUP($D22,TTrKT_,LCT_+1,0)","v":0.20399999999999999},{"$f":"HLOOKUP($E22,TTrKT_,LCT_+1,0)","v":0.20399999999999999},{"$f":"IF(GD_=3,0,XD_TB)","v":0},{"$f":"IF($D22=$E22,$F22,FORECAST(XD_TB,$F22:$G22,$D22:$E22))","v":0.20399999999999999},null,{"$f":"IF(J22<>0,H22*I22*J22*10^7,H22*I22*10^7)","v":0},{"$f":"K22*10%","v":0},{"$f":"K22+L22","v":0},null,null,null,{"$f":"IF(LBC_<=2,\"TRUE\")","v":"TRUE"},{"$f":"IF(GD_=3,\"Hợp đồng đã ký\",\"\")","v":"Hợp đồng đã ký"}]
[19,"TVTTrBCKTKT","Chi phí thẩm tra báo cáo kinh tế - kỹ thuật",null,null,null,null,{"$f":"IF(LBC_=3,XD_TB,0)","v":0},{"$f":"(I61+I63)*1.2","v":0.60960000000000003},null,{"$f":"IF(J23<>0,H23*I23*J23*10^7,H23*I23*10^7)","v":0},{"$f":"K23*10%","v":0},{"$f":"K23+L23","v":0},null,null,null,{"$f":"IF(LBC_=3,\"TRUE\")","v":false},{"$f":"IF(LBC_=3,\"Gxd*ĐMTL(T.tra TK+T.tra DT)*hệ số\",\"\")","v":""}]
[20,"TVDTTV-1","Chi phí lập HSMT, đánh giá HSDT tư vấn",{"$f":"IF($H$24<=MIN($T$322:$Z$322),MIN($T$322:$Z$322),LOOKUP($H$24,$T$322:$Z$322))","v":1},{"$f":"IF($H$24<=MIN($T$322:$Z$322),$D24,INDEX($T$322:$Z$322,0,IF($H$24>=MAX($T$322:$Z$322),MATCH($D24,$T$322:$Z$322,0),MATCH($D24,$T$322:$Z$322,0)+1)))","v":1},{"$f":"HLOOKUP($D24,Data_DTTV,2,0)","v":0.81599999999999995},{"$f":"HLOOKUP($E24,Data_DTTV,2,0)","v":0.81599999999999995},null,{"$f":"IF($D24=$E24,$F24,FORECAST($H$24,$F24:$G24,$D24:$E24))","v":0.81599999999999995},null,{"$f":"IF(J24<>0,H24*I24*J24*10^7,H24*I24*10^7)","v":0},{"$f":"0.1*K24","v":0},{"$f":"SUM(K24:L24)","v":0}]
[21,"TVNVKS","Chi phí lập nhiệm vụ khảo sát xây dựng",null,null,null,null,null,null,null,null,null,null,null,null,null,true]
[22,"TVKSXD-DT","Chi phí khảo sát xây dựng (bước lập thiết kế kỹ thuật, thiết kế BVTC)",null,null,null,null,null,null,null,null,null,null,null,null,null,true]
[23,"TVGSKS-DT-1","Chi phí giám sát công tác khảo sát xây dựng (bước lập thiết kế kỹ thuật, thiết kế BVTC)",{"$f":"IF(H27<=MIN($T$367:$X$367),MIN($T$367:$X$367),LOOKUP(H27,$T$367:$X$367))","v":1},{"$f":"IF(H27<=MIN($T$367:$X$367),$D27,INDEX($T$367:$X$367,0,IF(H27>=MAX($T$367:$X$367),MATCH($D27,$T$367:$X$367,0),MATCH($D27,$T$367:$X$367,0)+1)))","v":1},{"$f":"HLOOKUP(D27,Data_GSKS,2,0)","v":4.0720000000000001},{"$f":"HLOOKUP(E27,Data_GSKS,2,0)","v":4.0720000000000001},null,{"$f":"IF($D27=$E27,$F27,FORECAST(GTKS_,$F27:$G27,$D27:$E27))","v":4.0720000000000001},null,{"$f":"IF(J27<>0,H27*I27*J27*10^7,H27*I27*10^7)","v":0},{"$f":"0.1*K27","v":0},{"$f":"SUM(K27:L27)","v":0},"Loại CT","Cấp","Bước"]
[24,"TVTKKTDD","Chi phí thiết kế kỹ thuật công trình dân dụng",{"$f":"IF(P28<>3,0,IF($H28<=MIN($T$181:$AD$181),MIN($T$181:$AD$181),LOOKUP($H28,$T$181:$AD$181)))","v":0},{"$f":"IF(P28<>3,0,IF($H28<=MIN($T$181:$AD$181),D28,INDEX($T$181:$AD$181,0,IF($H28=MAX($T$181:$AD$181),MATCH(D28,$T$181:$AD$181,0),MATCH(D28,$T$181:$AD$181,0)+1))))","v":0},{"$f":"IF(P28<>3,0,HLOOKUP(D28,TKDD3,O28+1,0))","v":0},{"$f":"IF(P28<>3,0,HLOOKUP(E28,TKDD3,O28+1,0))","v":0},{"$f":"IF(AND(GD_=3,BTK_>1),XDTM_,XD_)","v":0},{"$f":"IF(F28=G28,G28,FORECAST($H28,F28:G28,D28:E28))","v":0},null,{"$f":"IF(J28<>0,H28*I28*J28*10^7,H28*I28*10^7)+K30","v":0},{"$f":"0.1*K28","v":0},{"$f":"SUM(K28:L28)","v":0},1,{"$f":"CCT_","v":3},{"$f":"BTK_","v":2},{"$f":"IF(AND(LCT_=1,BTK_>2),\"TRUE\")","v":false},{"$f":"IF(GD_=3,\"Hợp đồng đã ký\",\"\")","v":"Hợp đồng đã ký"}]
[25,"TVTKBVTCDD","Chi phí thiết kế bản vẽ thi công công trình dân dụng",{"$f":"IF(P29=3,0,IF($H29<=MIN($T$181:$AD$181),MIN($T$181:$AD$181),LOOKUP($H29,$T$181:$AD$181)))","v":10},{"$f":"IF(P29=3,0,IF($H29<=MIN($T$181:$AD$181),D29,INDEX($T$181:$AD$181,0,IF($H29>=MAX($T$181:$AD$181),MATCH(D29,$T$181:$AD$181,0),MATCH(D29,$T$181:$AD$181,0)+1))))","v":10},{"$f":"IF(P29=3,0,HLOOKUP(D29,TKDD2,O29+1,0))","v":3.85},{"$f":"IF(P29=3,0,HLOOKUP(E29,TKDD2,O29+1,0))","v":3.85},{"$f":"IF(AND(GD_=3,BTK_>1),XDTM_,XD_)","v":0},{"$f":"IF(P29=3,55%*I28,IF(F29=G29,G29,FORECAST($H29,F29:G29,D29:E29)))","v":3.85},null,{"$f":"IF(J29<>0,H29*I29*J29*10^7,H29*I29*10^7)+IF(P29=3,55%*K30,K30)","v":0},{"$f":"0.1*K29","v":0},{"$f":"SUM(K29:L29)","v":0},1,3,2,{"$f":"IF(AND(LCT_=1,BTK_>=2),\"TRUE\")","v":"TRUE"},{"$f":"IF(GD_=3,\"Hợp đồng đã ký\",IF(AND(Q29=\"TRUE\",$M$30<>0),\"Gxd*\"&TEXT(I29,\"0,000\")&\"+Gtb*\"&TEXT($I$30,\"0,000\"),\"\"))","v":"Hợp đồng đã ký"}]
[26,"TVTKDD1","Chi phí thiết kế lắp đặt thiết bị trường hợp chi phí thiết bị ≥ 50% tổng chi phí xây dựng và chi phí thiết bị ",{"$f":"IF($H30<=MIN($AH$181:$AP$181),MIN($AH$181:$AP$181),LOOKUP($H30,$AH$181:$AP$181))","v":5},{"$f":"IF($H30<=MIN($AH$181:$AP$181),D30,INDEX($AH$181:$AP$181,0,IF(H30>=MAX($AH$181:$AP$181),MATCH($D30,$AH$181:$AP$181,0),MATCH($D30,$AH$181:$AP$181,0)+1)))","v":5},{"$f":"HLOOKUP(D30,DD1_,2,0)","v":0.6},{"$f":"HLOOKUP(E30,DD1_,2,0)","v":0.6},{"$f":"IF(AND(GD_=3,BTK_>1,TBTM_>0.5*XDTB_TM),TBTM_,IF(TB_>0.5*XD_TB,TB_,0))","v":0},{"$f":"IF(F30=G30,G30,FORECAST($H30,F30:G30,D30:E30))","v":0.6},null,{"$f":"IF(J30<>0,H30*I30*J30*10^7,H30*I30*10^7)","v":0},{"$f":"0.1*K30","v":0},{"$f":"SUM(K30:L30)","v":0}]
[27,"TVTKKTCN","Chi phí thiết kế kỹ thuật công trình công nghiệp",{"$f":"IF(P31<>3,0,IF($H31<=MIN($T$181:$AD$181),MIN($T$181:$AD$181),LOOKUP($H31,$T$181:$AD$181)))","v":0},{"$f":"IF(P31<>3,0,IF($H31<=MIN($T$181:$AD$181),D31,INDEX($T$181:$AD$181,0,IF($H31=MAX($T$181:$AD$181),MATCH(D31,$T$181:$AD$181,0),MATCH(D31,$T$181:$AD$181,0)+1))))","v":0},{"$f":"IF(P31<>3,0,HLOOKUP(D31,TKCN3,O31+1,0))","v":0},{"$f":"IF(P31<>3,0,HLOOKUP(E31,TKCN3,O31+1,0))","v":0},{"$f":"IF(AND(GD_=3,BTK_>1),XDTM_,XD_)","v":0},{"$f":"IF(F31=G31,G31,FORECAST($H31,F31:G31,D31:E31))","v":0},null,{"$f":"IF(J31<>0,H31*I31*J31*10^7,H31*I31*10^7)","v":0},0,{"$f":"SUM(K31:L31)","v":0},2,3,2,{"$f":"IF(AND(LCT_=2,BTK_>2),\"TRUE\")","v":false},{"$f":"IF(GD_=3,\"Hợp đồng đã ký\",\"\")","v":"Hợp đồng đã ký"}]
[28,"TVTKBVTCCN","Chi phí thiết kế bản vẽ thi công công trình công nghiệp",{"$f":"IF(P32=3,0,IF($H32<=MIN($T$181:$AD$181),MIN($T$181:$AD$181),LOOKUP($H32,$T$181:$AD$181)))","v":10},{"$f":"IF(P32=3,0,IF($H32<=MIN($T$181:$AD$181),D32,INDEX($T$181:$AD$181,0,IF($H32>=MAX($T$181:$AD$181),MATCH(D32,$T$181:$AD$181,0),MATCH(D32,$T$181:$AD$181,0)+1))))","v":10},{"$f":"IF(P32=3,0,HLOOKUP(D32,TKCN2,O32+1,0))","v":3.13},{"$f":"IF(P32=3,0,HLOOKUP(E32,TKCN2,O32+1,0))","v":3.13},{"$f":"IF(AND(GD_=3,BTK_>1),XDTM_,XD_)","v":0},{"$f":"IF(P32=3,60%*I31,IF(F32=G32,G32,FORECAST($H32,F32:G32,D32:E32)))","v":3.13},null,{"$f":"IF(J32<>0,H32*I32*J32*10^7,H32*I32*10^7)","v":0},0,0,2,3,2,{"$f":"IF(AND(LCT_=2,BTK_>=2),\"TRUE\")","v":false},"Hợp đồng đã ký"]
[29,"TVTKCN1.1","Chi phí thiết kế công trình cáp ngầm điện áp < 6KV",{"$f":"IF(H33<=MIN($AH$202:$AN$202),MIN($AH$202:$AN$202),LOOKUP(H33,$AH$202:$AN$202))","v":5},{"$f":"IF(H33<=MIN($AH$202:$AN$202),$D33,INDEX($AH$202:$AN$202,0,IF(H33>=MAX($AH$202:$AN$202),MATCH($D33,$AH$202:$AN$202,0),MATCH($D33,$AH$202:$AN$202,0)+1)))","v":5},{"$f":"HLOOKUP($D33,CN1_,2,0)","v":1.7},{"$f":"HLOOKUP($E33,CN1_,2,0)","v":1.7},{"$f":"IF(AND(GD_=3,BTK_>1),XDTB_TM,XD_TB)","v":0},{"$f":"IF($D33=$E33,$F33,FORECAST(H33,$F33:$G33,$D33:$E33))","v":1.7},{"$f":"IF($P$32>2,1.15,0)","v":0},{"$f":"IF(J33<>0,H33*I33*J33*10^7,H33*I33*10^7)","v":0},{"$f":"0.1*K33","v":0},{"$f":"SUM(K33:L33)","v":0},null,null,null,null,"Hợp đồng đã ký"]
[30,"TVTKCN1.2","Chi phí thiết kế công trình cáp ngầm điện áp 6 ÷ 110KV",{"$f":"IF(H34<=MIN($AH$202:$AN$202),MIN($AH$202:$AN$202),LOOKUP(H34,$AH$202:$AN$202))","v":5},{"$f":"IF(H34<=MIN($AH$202:$AN$202),$D34,INDEX($AH$202:$AN$202,0,IF(H34>=MAX($AH$202:$AN$202),MATCH($D34,$AH$202:$AN$202,0),MATCH($D34,$AH$202:$AN$202,0)+1)))","v":5},{"$f":"HLOOKUP($D34,CN1_,3,0)","v":1.9},{"$f":"HLOOKUP($E34,CN1_,3,0)","v":1.9},{"$f":"IF(AND(GD_=3,BTK_>1),XDTB_TM,XD_TB)","v":0},1.9,{"$f":"IF($P$32>2,1.15,0)","v":0},0,0,0,null,null,null,null,"Hợp đồng đã ký"]
[31,"TVTKCN1.3","Chi phí thiết kế công trình cáp ngầm điện áp 220KV",{"$f":"IF(H35<=MIN($AH$202:$AN$202),MIN($AH$202:$AN$202),LOOKUP(H35,$AH$202:$AN$202))","v":5},{"$f":"IF(H35<=MIN($AH$202:$AN$202),$D35,INDEX($AH$202:$AN$202,0,IF(H35>=MAX($AH$202:$AN$202),MATCH($D35,$AH$202:$AN$202,0),MATCH($D35,$AH$202:$AN$202,0)+1)))","v":5},{"$f":"HLOOKUP($D35,CN1_,4,0)","v":1.65},{"$f":"HLOOKUP($E35,CN1_,4,0)","v":1.65},{"$f":"IF(AND(GD_=3,BTK_>1),XDTB_TM,XD_TB)","v":0},1.65,0,0,0,0,null,null,null,null,"Hợp đồng đã ký"]
[32,"TVTKCN2.1","Chi phí thiết kế phần thiết bị công trình hóa chất trường hợp chi phí thiết bị ≥ 50% tổng chi phí xây dựng và chi phí thiết bị ",{"$f":"IF($H36<=MIN($AH$211:$AP$211),MIN($AH$211:$AP$211),LOOKUP($H36,$AH$211:$AP$211))","v":5},{"$f":"IF($H36<=MIN($AH$211:$AP$211),D36,INDEX($AH$211:$AP$211,0,IF(H36>=MAX($AH$211:$AP$211),MATCH($D36,$AH$211:$AP$211,0),MATCH($D36,$AH$211:$AP$211,0)+1)))","v":5},{"$f":"HLOOKUP(D36,CN2_,2,0)","v":1.1000000000000001},{"$f":"HLOOKUP(E36,CN2_,2,0)","v":1.1000000000000001},{"$f":"IF(AND(GD_=3,BTK_>1,TBTM_>0.5*XDTB_TM),TBTM_,IF(TB_>0.5*XD_TB,TB_,0))","v":0},1.1000000000000001,null,0,0,0,null,null,null,null,"Hợp đồng đã ký"]
[33,"TVTKCN2.2","Chi phí thiết kế phần thiết bị công trình khai thác than, quặng (mỏ vật liệu) mỏ lộ thiên trường hợp chi phí thiết bị ≥ 50% tổng chi phí xây dựng và chi phí thiết bị",{"$f":"IF($H37<=MIN($AH$211:$AP$211),MIN($AH$211:$AP$211),LOOKUP($H37,$AH$211:$AP$211))","v":5},{"$f":"IF($H37<=MIN($AH$211:$AP$211),D37,INDEX($AH$211:$AP$211,0,IF(H37>=MAX($AH$211:$AP$211),MATCH($D37,$AH$211:$AP$211,0),MATCH($D37,$AH$211:$AP$211,0)+1)))","v":5},{"$f":"HLOOKUP(D37,CN2_,4,0)","v":0.95},{"$f":"HLOOKUP(E37,CN2_,4,0)","v":0.95},{"$f":"IF(AND(GD_=3,BTK_>1,TBTM_>0.5*XDTB_TM),TBTM_,IF(TB_>0.5*XD_TB,TB_,0))","v":0},0.95,null,0,0,0,null,null,null,null,"Hợp đồng đã ký"]
[34,"TVTKCN2.3","Chi phí thiết kế phần thiết bị công trình khai thác than, quặng (mỏ vật liệu) mỏ hầm lò trường hợp chi phí thiết bị ≥ 50% tổng chi phí xây dựng và chi phí thiết bị",{"$f":"IF($H38<=MIN($AH$211:$AP$211),MIN($AH$211:$AP$211),LOOKUP($H38,$AH$211:$AP$211))","v":5},{"$f":"IF($H38<=MIN($AH$211:$AP$211),D38,INDEX($AH$211:$AP$211,0,IF(H38>=MAX($AH$211:$AP$211),MATCH($D38,$AH$211:$AP$211,0),MATCH($D38,$AH$211:$AP$211,0)+1)))","v":5},{"$f":"HLOOKUP(D38,CN2_,5,0)","v":1.1499999999999999},{"$f":"HLOOKUP(E38,CN2_,5,0)","v":1.1499999999999999},{"$f":"IF(AND(GD_=3,BTK_>1,TBTM_>0.5*XDTB_TM),TBTM_,IF(TB_>0.5*XD_TB,TB_,0))","v":0},1.1499999999999999,null,0,0,0,null,null,null,null,"Hợp đồng đã ký"]
[35,"TVTKCN2.4","Chi phí thiết kế phần thiết bị công trình sản xuất xi măng trường hợp chi phí thiết bị ≥ 50% tổng chi phí xây dựng và chi phí thiết bị",{"$f":"IF($H39<=MIN($AH$211:$AP$211),MIN($AH$211:$AP$211),LOOKUP($H39,$AH$211:$AP$211))","v":5},{"$f":"IF($H39<=MIN($AH$211:$AP$211),D39,INDEX($AH$211:$AP$211,0,IF(H39>=MAX($AH$211:$AP$211),MATCH($D39,$AH$211:$AP$211,0),MATCH($D39,$AH$211:$AP$211,0)+1)))","v":5},{"$f":"HLOOKUP(D39,CN2_,6,0)","v":0},{"$f":"HLOOKUP(E39,CN2_,6,0)","v":0},{"$f":"IF(AND(GD_=3,BTK_>1,TBTM_>0.5*XDTB_TM),TBTM_,IF(TB_>0.5*XD_TB,TB_,0))","v":0},0,null,0,0,0,null,null,null,null,"Hợp đồng đã ký"]
[36,"TVTKCN2.5","Chi phí thiết kế phần thiết bị công trình trạm biến áp trường hợp chi phí thiết bị ≥ 50% tổng chi phí xây dựng và chi phí thiết bị",{"$f":"IF($H40<=MIN($AH$211:$AP$211),MIN($AH$211:$AP$211),LOOKUP($H40,$AH$211:$AP$211))","v":5},{"$f":"IF($H40<=MIN($AH$211:$AP$211),D40,INDEX($AH$211:$AP$211,0,IF(H40>=MAX($AH$211:$AP$211),MATCH($D40,$AH$211:$AP$211,0),MATCH($D40,$AH$211:$AP$211,0)+1)))","v":5},{"$f":"HLOOKUP(D40,CN2_,7,0)","v":0.73},{"$f":"HLOOKUP(E40,CN2_,7,0)","v":0.73},{"$f":"IF(AND(GD_=3,BTK_>1,TBTM_>0.5*XDTB_TM),TBTM_,IF(TB_>0.5*XD_TB,TB_,0))","v":0},0.73,null,0,0,0,null,null,null,null,"Hợp đồng đã ký"]
[37,"TVTKKTGT","Chi phí thiết kế kỹ thuật công trình giao thông",{"$f":"IF(P41<>3,0,IF($H41<=MIN($T$181:$AD$181),MIN($T$181:$AD$181),LOOKUP($H41,$T$181:$AD$181)))","v":0},{"$f":"IF(P41<>3,0,IF($H41<=MIN($T$181:$AD$181),D41,INDEX($T$181:$AD$181,0,IF($H41=MAX($T$181:$AD$181),MATCH(D41,$T$181:$AD$181,0),MATCH(D41,$T$181:$AD$181,0)+1))))","v":0},{"$f":"IF(P41<>3,0,HLOOKUP(D41,TKGT3,O41+1,0))","v":0},{"$f":"IF(P41<>3,0,HLOOKUP(E41,TKGT3,O41+1,0))","v":0},{"$f":"IF(AND(GD_=3,BTK_>1),XDTM_,XD_)","v":0},{"$f":"IF(F41=G41,G41,FORECAST($H41,F41:G41,D41:E41))","v":0},null,{"$f":"IF(J41<>0,H41*I41*J41*10^7,H41*I41*10^7)","v":0},{"$f":"0.1*K41","v":0},{"$f":"SUM(K41:L41)","v":0},3,3,2,{"$f":"IF(AND(LCT_=3,BTK_>2),\"TRUE\")","v":false},"Hợp đồng đã ký"]
[38,"TVTKBVTCGT","Chi phí thiết kế bản vẽ thi công công trình giao thông",{"$f":"IF(P42=3,0,IF($H42<=MIN($T$181:$AD$181),MIN($T$181:$AD$181),LOOKUP($H42,$T$181:$AD$181)))","v":10},{"$f":"IF(P42=3,0,IF($H42<=MIN($T$181:$AD$181),D42,INDEX($T$181:$AD$181,0,IF($H42>=MAX($T$181:$AD$181),MATCH(D42,$T$181:$AD$181,0),MATCH(D42,$T$181:$AD$181,0)+1))))","v":10},{"$f":"IF(P42=3,0,HLOOKUP(D42,TKGT2,O42+1,0))","v":1.67},{"$f":"IF(P42=3,0,HLOOKUP(E42,TKGT2,O42+1,0))","v":1.67},{"$f":"IF(AND(GD_=3,BTK_>1),XDTM_,XD_)","v":0},{"$f":"IF(P42=3,55%*I41,IF(F42=G42,G42,FORECAST($H42,F42:G42,D42:E42)))","v":1.67},null,0,0,0,3,3,2,{"$f":"IF(AND(LCT_=3,BTK_>=2),\"TRUE\")","v":false},"Hợp đồng đã ký"]
[39,"TVTKKTNT","Chi phí thiết kế kỹ thuật công trình nông nghiệp - phát triển nông thôn",{"$f":"IF(P43<>3,0,IF($H43<=MIN($T$181:$AD$181),MIN($T$181:$AD$181),LOOKUP($H43,$T$181:$AD$181)))","v":0},{"$f":"IF(P43<>3,0,IF($H43<=MIN($T$181:$AD$181),D43,INDEX($T$181:$AD$181,0,IF($H43=MAX($T$181:$AD$181),MATCH(D43,$T$181:$AD$181,0),MATCH(D43,$T$181:$AD$181,0)+1))))","v":0},{"$f":"IF(P43<>3,0,HLOOKUP(D43,TKNN3,O43+1,0))","v":0},{"$f":"IF(P43<>3,0,HLOOKUP(E43,TKNN3,O43+1,0))","v":0},{"$f":"IF(AND(GD_=3,BTK_>1),XDTM_,XD_)","v":0},{"$f":"IF(F43=G43,G43,FORECAST($H43,F43:G43,D43:E43))","v":0},null,0,0,0,4,3,2,{"$f":"IF(AND(LCT_=4,BTK_>2),\"TRUE\")","v":false},"Hợp đồng đã ký"]
[40,"TVTKBVTCNT","Chi phí thiết kế bản vẽ thi công công trình nông nghiệp - phát triển nông thôn",{"$f":"IF(P44=3,0,IF($H44<=MIN($T$181:$AD$181),MIN($T$181:$AD$181),LOOKUP($H44,$T$181:$AD$181)))","v":10},{"$f":"IF(P44=3,0,IF($H44<=MIN($T$181:$AD$181),D44,INDEX($T$181:$AD$181,0,IF($H44>=MAX($T$181:$AD$181),MATCH(D44,$T$181:$AD$181,0),MATCH(D44,$T$181:$AD$181,0)+1))))","v":10},{"$f":"IF(P44=3,0,HLOOKUP(D44,TKNN2,O44+1,0))","v":3.53},{"$f":"IF(P44=3,0,HLOOKUP(E44,TKNN2,O44+1,0))","v":3.53},{"$f":"IF(AND(GD_=3,BTK_>1),XDTM_,XD_)","v":0},{"$f":"IF(P44=3,55%*I43,IF(F44=G44,G44,FORECAST($H44,F44:G44,D44:E44)))","v":3.53},null,0,0,0,4,3,2,{"$f":"IF(AND(LCT_=4,BTK_>=2),\"TRUE\")","v":false},"Hợp đồng đã ký"]
[41,"TVTKTL1","Chi phí thiết kế chế tạo thiết bị cơ khí",{"$f":"IF($H45<=MIN($AL$243:$AR$243),MIN($AL$243:$AR$243),LOOKUP($H45,$AL$243:$AR$243))","v":2},{"$f":"IF($H45<=MIN($AL$243:$AR$243),D45,INDEX($AL$243:$AR$243,0,IF(H45>=MAX($AL$243:$AR$243),MATCH($D45,$AL$243:$AR$243,0),MATCH($D45,$AL$243:$AR$243,0)+1)))","v":2},{"$f":"HLOOKUP(D45,TL1_,IF(CCT_<=2,2,3),0)","v":2.58},{"$f":"HLOOKUP(E45,TL1_,IF(CCT_<=2,2,3),0)","v":2.58},{"$f":"IF(AND(GD_=3,BTK_>1),TBTM_,TB_)","v":0},{"$f":"IF($D45=$E45,$F45,FORECAST(H45,$F45:$G45,$D45:$E45))","v":2.58},null,{"$f":"IF(J45<>0,H45*I45*J45*10^7,H45*I45*10^7)","v":0},{"$f":"0.1*K45","v":0},{"$f":"SUM(K45:L45)","v":0},null,null,null,null,"Hợp đồng đã ký"]
[42,"TVTKKTHT","Chi phí thiết kế kỹ thuật công trình hạ tầng kỹ thuật",{"$f":"IF(P46<>3,0,IF($H46<=MIN($T$181:$AD$181),MIN($T$181:$AD$181),LOOKUP($H46,$T$181:$AD$181)))","v":0},{"$f":"IF(P46<>3,0,IF($H46<=MIN($T$181:$AD$181),D46,INDEX($T$181:$AD$181,0,IF($H46=MAX($T$181:$AD$181),MATCH(D46,$T$181:$AD$181,0),MATCH(D46,$T$181:$AD$181,0)+1))))","v":0},{"$f":"IF(P46<>3,0,HLOOKUP(D46,TKHT3,O46+1,0))","v":0},{"$f":"IF(P46<>3,0,HLOOKUP(E46,TKHT3,O46+1,0))","v":0},{"$f":"IF(AND(GD_=3,BTK_>1),XDTM_,XD_)","v":0},{"$f":"IF(F46=G46,G46,FORECAST($H46,F46:G46,D46:E46))","v":0},null,0,0,0,5,3,2,{"$f":"IF(AND(LCT_=5,BTK_>2),\"TRUE\")","v":false},"Hợp đồng đã ký"]
[43,"TVTKBVTCHT","Chi phí thiết kế bản vẽ thi công công trình hạ tầng kỹ thuật",{"$f":"IF(P47=3,0,IF($H47<=MIN($T$181:$AD$181),MIN($T$181:$AD$181),LOOKUP($H47,$T$181:$AD$181)))","v":10},{"$f":"IF(P47=3,0,IF($H47<=MIN($T$181:$AD$181),D47,INDEX($T$181:$AD$181,0,IF($H47>=MAX($T$181:$AD$181),MATCH(D47,$T$181:$AD$181,0),MATCH(D47,$T$181:$AD$181,0)+1))))","v":10},{"$f":"IF(P47=3,0,HLOOKUP(D47,TKHT2,O47+1,0))","v":2.68},{"$f":"IF(P47=3,0,HLOOKUP(E47,TKHT2,O47+1,0))","v":2.68},{"$f":"IF(AND(GD_=3,BTK_>1),XDTM_,XD_)","v":0},{"$f":"IF(P47=3,55%*I46,IF(F47=G47,G47,FORECAST($H47,F47:G47,D47:E47)))","v":2.68},null,0,0,0,5,3,2,{"$f":"IF(AND(LCT_=5,BTK_>=2),\"TRUE\")","v":false},"Hợp đồng đã ký"]
[44,"TVTKHTKT1.1","Chi phí thiết kế Công trình cáp chôn trực tiếp",{"$f":"IF($H48<=MIN($AH$272:$AO$272),MIN($AH$272:$AO$272),LOOKUP($H48,$AH$272:$AO$272))","v":5},{"$f":"IF($H48<=MIN($AH$272:$AO$272),D48,INDEX($AH$272:$AO$272,0,IF(H48>=MAX($AH$272:$AO$272),MATCH($D48,$AH$272:$AO$272,0),MATCH($D48,$AH$272:$AO$272,0)+1)))","v":5},{"$f":"HLOOKUP(D48,HTKT1_,2,0)","v":1.83},{"$f":"HLOOKUP(E48,HTKT1_,2,0)","v":1.83},{"$f":"IF(AND(GD_=3,BTK_>1),XDTB_TM,XD_TB)","v":0},{"$f":"IF($D48=$E48,$F48,FORECAST(H48,$F48:$G48,$D48:$E48))","v":1.83},{"$f":"IF(AND(H48<=1,CCT_=5),1.3*0.9,IF(CCT_=5,0.9,IF(H48<=1,1.3,0)))","v":1.3},0,0,0,null,null,null,null,"Hợp đồng đã ký"]
[45,"TVTKHTKT1.2","Chi phí thiết kế Công trình tuyến cáp chôn qua sông",5,5,{"$f":"HLOOKUP(D49,HTKT1_,3,0)","v":1.9},{"$f":"HLOOKUP(E49,HTKT1_,3,0)","v":1.9},0,1.9,{"$f":"IF(AND(H49<=1,CCT_=5),1.3*0.9,IF(CCT_=5,0.9,IF(H49<=1,1.3,0)))","v":1.3},0,0,0,null,null,null,null,"Hợp đồng đã ký"]
[46,"TVTKHTKT1.3","Chi phí thiết kế Công trình hào kỹ thuật, cống cáp",5,5,{"$f":"HLOOKUP(D50,HTKT1_,4,0)","v":2.1},{"$f":"HLOOKUP(E50,HTKT1_,4,0)","v":2.1},0,2.1,{"$f":"IF(AND(H50<=1,CCT_=5),1.3*0.9,IF(CCT_=5,0.9,IF(H50<=1,1.3,0)))","v":1.3},0,0,0,null,null,null,null,"Hợp đồng đã ký"]
[47,"TVTKHTKT2.1","Chi phí thiết kế các loại tổng đài host, vệ tinh, độc lập",5,5,{"$f":"HLOOKUP(D51,HTKT2_,2,0)","v":1},{"$f":"HLOOKUP(E51,HTKT2_,2,0)","v":1},0,1,null,0,0,0,null,null,null,null,"Hợp đồng đã ký"]
[48,"TVTKHTKT2.2","Chi phí thiết kế các loại tổng đài MSC, BSC, truy nhập thuê bao, nhắn tin",5,5,{"$f":"HLOOKUP(D52,HTKT2_,3,0)","v":0.9},{"$f":"HLOOKUP(E52,HTKT2_,3,0)","v":0.9},0,0.9,null,0,0,0,null,null,null,null,"Hợp đồng đã ký"]
[49,"TVTKHTKT2.3","Chi phí thiết kế hệ thống thiết bị truyền dẫn quang",5,5,{"$f":"HLOOKUP(D53,HTKT2_,4,0)","v":1.35},{"$f":"HLOOKUP(E53,HTKT2_,4,0)","v":1.35},0,1.35,null,0,0,0,null,null,null,null,"Hợp đồng đã ký"]
[50,"TVTKHTKT2.4","Chi phí thiết kế hệ thống truyền dẫn vi ba",5,5,{"$f":"HLOOKUP(D54,HTKT2_,5,0)","v":1.7},{"$f":"HLOOKUP(E54,HTKT2_,5,0)","v":1.7},0,1.7,null,0,0,0,null,null,null,null,"Hợp đồng đã ký"]
[51,"TVTKHTKT2.5","Chi phí thiết kế mạng viễn thông nông thôn",5,5,{"$f":"HLOOKUP(D55,HTKT2_,6,0)","v":2.8},{"$f":"HLOOKUP(E55,HTKT2_,6,0)","v":2.8},0,2.8,null,0,0,0,null,null,null,null,"Hợp đồng đã ký"]
[52,"TVTKHTKT2.6","Chi phí thiết kế mạng Internet, Voip, thiết bị mạng NGN",5,5,{"$f":"HLOOKUP(D56,HTKT2_,7,0)","v":1},{"$f":"HLOOKUP(E56,HTKT2_,7,0)","v":1},0,1,null,0,0,0,null,null,null,null,"Hợp đồng đã ký"]
[53,"TVTKHTKT2.7","Chi phí thiết kế hệ thống tiếp đất chống sét (cả thiết bị)",5,5,{"$f":"HLOOKUP(D57,HTKT2_,8,0)","v":2.15},{"$f":"HLOOKUP(E57,HTKT2_,8,0)","v":2.15},0,2.15,null,0,0,0,null,null,null,null,"Hợp đồng đã ký"]
[54,"TVTKHTKT2.8","Chi phí thiết kế trạm thông tin vệ tinh Vsat",5,5,{"$f":"HLOOKUP(D58,HTKT2_,9,0)","v":1.8},{"$f":"HLOOKUP(E58,HTKT2_,9,0)","v":1.8},0,1.8,null,0,0,0,null,null,null,null,"Hợp đồng đã ký"]
[55,"TVTKHTKT2.9","Chi phí thiết kế trạm BTS, CS, điện thoại thẻ",5,5,{"$f":"HLOOKUP(D59,HTKT2_,10,0)","v":1.25},{"$f":"HLOOKUP(E59,HTKT2_,10,0)","v":1.25},0,1.25,null,0,0,0,null,null,null,null,"Hợp đồng đã ký"]
[56,"TVTTrTKKT","Chi phí thẩm tra thiết kế kỹ thuật",{"$f":"IF(P60<>3,0,IF($H60<=MIN($T$181:$AD$181),MIN($T$181:$AD$181),LOOKUP($H60,$T$181:$AD$181)))","v":0},{"$f":"IF(P60<>3,0,IF($H60<=MIN($T$181:$AD$181),D60,INDEX($T$181:$AD$181,0,IF($H60=MAX($T$181:$AD$181),MATCH(D60,$T$181:$AD$181,0),MATCH(D60,$T$181:$AD$181,0)+1))))","v":0},{"$f":"IF(P60<>3,0,HLOOKUP($D60,TTrTK_,N60+1,0))","v":0},{"$f":"IF(P60<>3,0,HLOOKUP($E60,TTrTK_,N60+1,0))","v":0},{"$f":"IF(GD_=3,XDTM_,XD_)","v":0},{"$f":"IF($D60=$E60,$F60,FORECAST(H60,$F60:$G60,$D60:$E60))","v":0},null,{"$f":"IF(IF(J60<>0,H60*I60*J60*10^7,H60*I60*10^7)>2000000,IF(J60<>0,H60*I60*J60*10^7,H60*I60*10^7),2000000)","v":2000000},200000,{"$f":"K60+L60","v":2200000},{"$f":"LCT_","v":1},null,2,{"$f":"IF(BTK_>2,TRUE)","v":false},{"$f":"IF(AND(BTK_>2,GD_=3),\"Hợp đồng đã ký\",\"\")","v":""}]
[57,"TVTTrTKBVTC","Chi phí thẩm tra thiết kế BVTC",{"$f":"IF($H61<=MIN($T$181:$AD$181),MIN($T$181:$AD$181),LOOKUP($H61,$T$181:$AD$181))","v":10},{"$f":"IF($H61<=MIN($T$181:$AD$181),D61,INDEX($T$181:$AD$181,0,IF($H61>=MAX($T$181:$AD$181),MATCH(D61,$T$181:$AD$181,0),MATCH(D61,$T$181:$AD$181,0)+1)))","v":10},{"$f":"HLOOKUP($D61,TTrTK_,N61+1,0)","v":0.25800000000000001},{"$f":"HLOOKUP($E61,TTrTK_,N61+1,0)","v":0.25800000000000001},{"$f":"IF(GD_=3,XDTM_,XD_)","v":0},{"$f":"IF($D61=$E61,$F61,FORECAST(H61,$F61:$G61,$D61:$E61))","v":0.25800000000000001},null,{"$f":"IF(IF(J61<>0,H61*I61*J61*10^7,H61*I61*10^7)>2000000,IF(J61<>0,H61*I61*J61*10^7,H61*I61*10^7),2000000)","v":2000000},200000,{"$f":"K61+L61","v":2200000},1,null,2,{"$f":"IF(BTK_>=2,TRUE)","v":true},{"$f":"IF(K61>2000000,IF(GD_=3,\"Gxd(trong TMĐT)*ĐMTL\",\"\"),\"Tối thiểu không nhỏ hơn 2.000.000 đồng\")","v":"Tối thiểu không nhỏ hơn 2.000.000 đồng"}]
[58,"TVTTrDTKT","Chi phí thẩm tra dự toán thiết kế kỹ thuật",{"$f":"IF(P62<>3,0,IF($H62<=MIN($T$181:$AD$181),MIN($T$181:$AD$181),LOOKUP($H62,$T$181:$AD$181)))","v":0},{"$f":"IF(P62<>3,0,IF($H62<=MIN($T$181:$AD$181),D62,INDEX($T$181:$AD$181,0,IF($H62=MAX($T$181:$AD$181),MATCH(D62,$T$181:$AD$181,0),MATCH(D62,$T$181:$AD$181,0)+1))))","v":0},{"$f":"IF(P62<>3,0,HLOOKUP($D62,TTrDT_,N62+1,0))","v":0},{"$f":"IF(P62<>3,0,HLOOKUP($E62,TTrDT_,N62+1,0))","v":0},{"$f":"IF(GD_=3,XDTM_,XD_)","v":0},0,null,2000000,200000,{"$f":"K62+L62","v":2200000},1,null,2,{"$f":"Q60","v":false},{"$f":"IF(AND(BTK_>2,GD_=3),\"Hợp đồng đã ký\",\"\")","v":""}]
[59,"TVTTrDTBVTC","Chi phí thẩm tra dự toán thiết kế BVTC",{"$f":"IF($H63<=MIN($T$181:$AD$181),MIN($T$181:$AD$181),LOOKUP($H63,$T$181:$AD$181))","v":10},{"$f":"IF($H63<=MIN($T$181:$AD$181),D63,INDEX($T$181:$AD$181,0,IF($H63>=MAX($T$181:$AD$181),MATCH(D63,$T$181:$AD$181,0),MATCH(D63,$T$181:$AD$181,0)+1)))","v":10},{"$f":"HLOOKUP($D63,TTrDT_,N63+1,0)","v":0.25},{"$f":"HLOOKUP($E63,TTrDT_,N63+1,0)","v":0.25},{"$f":"IF(GD_=3,XDTM_,XD_)","v":0},0.25,null,2000000,200000,{"$f":"K63+L63","v":2200000},1,null,2,{"$f":"Q61","v":true},{"$f":"IF(K63>2000000,IF(GD_=3,\"Gxd(trong TMĐT)*ĐMTL\",\"\"),\"Tối thiểu không nhỏ hơn 2.000.000 đồng\")","v":"Tối thiểu không nhỏ hơn 2.000.000 đồng"}]
[60,"TVTKDC","Chi phí điều chỉnh thiết kế"]
[61,"TVDTDC","Chi phí lập dự toán điều chỉnh"]
[62,"TVTTrTKDC","Chi phí thẩm tra thiết kế điều chỉnh"]
[63,"TVTTrDTDC","Chi phí thẩm tra dự toán điều chỉnh"]
[64,"TVDTXD-1","Chi phí lập HSMT, đánh giá HSDT thi công xây dựng",{"$f":"IF($H$68<=MIN($T$328:$AA$328),MIN($T$328:$AA$328),LOOKUP($H$68,$T$328:$AA$328))","v":10},{"$f":"IF($H$68<=MIN($T$328:$AA$328),$D68,INDEX($T$328:$AA$328,0,IF($H$68>=MAX($T$328:$AA$328),MATCH($D68,$T$328:$AA$328,0),MATCH($D68,$T$328:$AA$328,0)+1)))","v":10},{"$f":"HLOOKUP(D68,Data_DTTCXD,LCT_+1,0)","v":0.432},{"$f":"HLOOKUP(E68,Data_DTTCXD,LCT_+1,0)","v":0.432},{"$f":"XD_","v":0},{"$f":"IF($D68=$E68,$F68,FORECAST($H$68,$F68:$G68,$D68:$E68))","v":0.432},null,{"$f":"IF(J68<>0,H68*I68*J68*10^7,H68*I68*10^7)","v":0},{"$f":"K68*10%","v":0},{"$f":"K68+L68","v":0},null,null,null,{"$f":"IF(XD_>1/1.1,\"TRUE\",\"FALSE\")","v":"FALSE"}]
[65,"TVDTTB-1","Chi phí lập HSMT, đánh giá HSDT mua sắm vật tư, thiết bị",{"$f":"IF($H$69<=MIN($T$328:$AA$328),MIN($T$328:$AA$328),LOOKUP($H$69,$T$328:$AA$328))","v":10},{"$f":"IF($H$69<=MIN($T$328:$AA$328),$D69,INDEX($T$328:$AA$328,0,IF($H$69>=MAX($T$328:$AA$328),MATCH($D69,$T$328:$AA$328,0),MATCH($D69,$T$328:$AA$328,0)+1)))","v":10},{"$f":"HLOOKUP(D69,Data_DTLDTB,LCT_+1,0)","v":0.36699999999999999},{"$f":"HLOOKUP(E69,Data_DTLDTB,LCT_+1,0)","v":0.36699999999999999},{"$f":"TB_","v":0},{"$f":"IF($D69=$E69,$F69,FORECAST($H$69,$F69:$G69,$D69:$E69))","v":0.36699999999999999},null,0,{"$f":"K69*10%","v":0},{"$f":"K69+L69","v":0},null,null,null,{"$f":"IF(TB_>1/1.1,\"TRUE\",\"FALSE\")","v":"FALSE"}]
[64,"TVDTXD-2","Chi phí lập HSMT, đánh giá HSDT thi công xây dựng (trường hợp công trình chia nhiều gói thầu XL)",{"$f":"IF($H$68<=MIN($T$328:$AA$328),MIN($T$328:$AA$328),LOOKUP($H$68,$T$328:$AA$328))","v":10},{"$f":"IF($H$68<=MIN($T$328:$AA$328),$D70,INDEX($T$328:$AA$328,0,IF($H$68>=MAX($T$328:$AA$328),MATCH($D70,$T$328:$AA$328,0),MATCH($D70,$T$328:$AA$328,0)+1)))","v":10},{"$f":"HLOOKUP(D70,Data_DTTCXD,LCT_+1,0)","v":0.432},{"$f":"HLOOKUP(E70,Data_DTTCXD,LCT_+1,0)","v":0.432},null,{"$f":"IF($D70=$E70,$F70,FORECAST($H$68,$F70:$G70,$D70:$E70))","v":0.432},null,{"$f":"IF(J70<>0,H70*I70*J70*10^7,H70*I70*10^7)","v":0},{"$f":"K70*10%","v":0},{"$f":"K70+L70","v":0}]
[65,"TVDTTB-2","Chi phí lập HSMT, đánh giá HSDT mua sắm vật tư, thiết bị (trường hợp công trình chia nhiều gói thầu mua sắm, lắp đặt TB)",{"$f":"IF($H$69<=MIN($T$328:$AA$328),MIN($T$328:$AA$328),LOOKUP($H$69,$T$328:$AA$328))","v":10},{"$f":"IF($H$69<=MIN($T$328:$AA$328),$D71,INDEX($T$328:$AA$328,0,IF($H$69>=MAX($T$328:$AA$328),MATCH($D71,$T$328:$AA$328,0),MATCH($D71,$T$328:$AA$328,0)+1)))","v":10},{"$f":"HLOOKUP(D71,Data_DTLDTB,LCT_+1,0)","v":0.36699999999999999},{"$f":"HLOOKUP(E71,Data_DTLDTB,LCT_+1,0)","v":0.36699999999999999},null,{"$f":"IF($D71=$E71,$F71,FORECAST($H$69,$F71:$G71,$D71:$E71))","v":0.36699999999999999},null,0,{"$f":"K71*10%","v":0},{"$f":"K71+L71","v":0}]
[66,"TVMQTDTXD1","Chi phí lập hồ sơ mời quan tâm, đánh giá hồ sơ quan tâm; lập hồ sơ mời sơ tuyển, đánh giá hồ sơ mời sơ tuyển gói thầu thi công xây dựng",{"$f":"IF($H$68<=MIN($T$328:$AA$328),MIN($T$328:$AA$328),LOOKUP($H$68,$T$328:$AA$328))","v":10},{"$f":"IF($H$68<=MIN($T$328:$AA$328),$D72,INDEX($T$328:$AA$328,0,IF($H$68>=MAX($T$328:$AA$328),MATCH($D72,$T$328:$AA$328,0),MATCH($D72,$T$328:$AA$328,0)+1)))","v":10},{"$f":"HLOOKUP(D72,Data_DTTCXD,LCT_+1,0)","v":0.432},{"$f":"HLOOKUP(E72,Data_DTTCXD,LCT_+1,0)","v":0.432},null,{"$f":"IF($D72=$E72,$F72,FORECAST($H$68,$F72:$G72,$D72:$E72))*30%","v":0.12959999999999999},null,0,0,0]
[67,"TVMQTDTTB1","Chi phí lập hồ sơ mời quan tâm, đánh giá hồ sơ quan tâm; lập hồ sơ mời sơ tuyển, đánh giá hồ sơ mời sơ tuyển gói thầu mua sắm vật tư, thiết bị",{"$f":"IF($H$69<=MIN($T$328:$AA$328),MIN($T$328:$AA$328),LOOKUP($H$69,$T$328:$AA$328))","v":10},{"$f":"IF($H$69<=MIN($T$328:$AA$328),$D73,INDEX($T$328:$AA$328,0,IF($H$69>=MAX($T$328:$AA$328),MATCH($D73,$T$328:$AA$328,0),MATCH($D73,$T$328:$AA$328,0)+1)))","v":10},{"$f":"HLOOKUP(D73,Data_DTLDTB,LCT_+1,0)","v":0.36699999999999999},{"$f":"HLOOKUP(E73,Data_DTLDTB,LCT_+1,0)","v":0.36699999999999999},null,{"$f":"IF($D73=$E73,$F73,FORECAST($H$69,$F73:$G73,$D73:$E73))*30%","v":0.11009999999999999},null,0,0,0]
[68,"TVDXXD1","Chi phí lập hồ sơ yêu cầu và đánh giá hồ sơ đề xuất gói thầu thi công xây dựng",{"$f":"IF($H$68<=MIN($T$328:$AA$328),MIN($T$328:$AA$328),LOOKUP($H$68,$T$328:$AA$328))","v":10},{"$f":"IF($H$68<=MIN($T$328:$AA$328),$D74,INDEX($T$328:$AA$328,0,IF($H$68>=MAX($T$328:$AA$328),MATCH($D74,$T$328:$AA$328,0),MATCH($D74,$T$328:$AA$328,0)+1)))","v":10},{"$f":"HLOOKUP(D74,Data_DTTCXD,LCT_+1,0)","v":0.432},{"$f":"HLOOKUP(E74,Data_DTTCXD,LCT_+1,0)","v":0.432},{"$f":"XD_","v":0},{"$f":"IF($D74=$E74,$F74,FORECAST($H$68,$F74:$G74,$D74:$E74))*60%","v":0.25919999999999999},null,0,0,0,null,null,null,{"$f":"IF(AND(XD_<=1/1.1,XD_>0),\"TRUE\",\"FALSE\")","v":"FALSE"}]
[69,"TVDXTB1","Chi phí lập hồ sơ yêu cầu và đánh giá hồ sơ đề xuất gói thầu mua sắm vật tư, thiết bị",{"$f":"IF($H$69<=MIN($T$328:$AA$328),MIN($T$328:$AA$328),LOOKUP($H$69,$T$328:$AA$328))","v":10},{"$f":"IF($H$69<=MIN($T$328:$AA$328),$D75,INDEX($T$328:$AA$328,0,IF($H$69>=MAX($T$328:$AA$328),MATCH($D75,$T$328:$AA$328,0),MATCH($D75,$T$328:$AA$328,0)+1)))","v":10},{"$f":"HLOOKUP(D75,Data_DTLDTB,LCT_+1,0)","v":0.36699999999999999},{"$f":"HLOOKUP(E75,Data_DTLDTB,LCT_+1,0)","v":0.36699999999999999},{"$f":"TB_","v":0},{"$f":"IF($D75=$E75,$F75,FORECAST($H$69,$F75:$G75,$D75:$E75))*60%","v":0.22019999999999998},null,0,0,0,null,null,null,{"$f":"IF(AND(TB_<=1/1.1,TB_>0),\"TRUE\",\"FALSE\")","v":"FALSE"}]
[70,"TVDXTV1","Chi phí lập hồ sơ yêu cầu và đánh giá hồ sơ đề xuất gói thầu tư vấn",{"$f":"IF($H$24<=MIN($T$322:$Z$322),MIN($T$322:$Z$322),LOOKUP($H$24,$T$322:$Z$322))","v":1},{"$f":"IF($H$24<=MIN($T$322:$Z$322),$D76,INDEX($T$322:$Z$322,0,IF($H$24>=MAX($T$322:$Z$322),MATCH($D76,$T$322:$Z$322,0),MATCH($D76,$T$322:$Z$322,0)+1)))","v":1},{"$f":"HLOOKUP($D76,Data_DTTV,2,0)","v":0.81599999999999995},{"$f":"HLOOKUP($E76,Data_DTTV,2,0)","v":0.81599999999999995},null,{"$f":"IF($D76=$E76,$F76,FORECAST($H$24,$F76:$G76,$D76:$E76))*60%","v":0.48959999999999992},null,0,{"$f":"0.1*K76","v":0},{"$f":"SUM(K76:L76)","v":0}]
[71,"TVLHSMQTXD-1","Chi phí lập hồ sơ mời quan tâm, hồ sơ mời sơ tuyển gói thầu thi công xây dựng (NĐ 63/2014-CP)",null,null,null,null,null,0.05,null,{"$f":"IF(IF(J77<>0,H77*I77*J77*10^7,H77*I77*10^7)<1000000,1000000,IF(IF(J77<>0,H77*I77*J77*10^7,H77*I77*10^7)>30000000,30000000,IF(J77<>0,H77*I77*J77*10^7,H77*I77*10^7)))","v":1000000},null,{"$f":"SUM(K77:L77)","v":1000000}]
[72,"TVLHSMQTTB-1","Chi phí lập hồ sơ mời quan tâm, hồ sơ mời sơ tuyển gói thầu mua sắm, lắp đặt thiết bị (NĐ 63/2014-CP)",null,null,null,null,null,0.05,null,{"$f":"IF(IF(J78<>0,H78*I78*J78*10^7,H78*I78*10^7)<1000000,1000000,IF(IF(J78<>0,H78*I78*J78*10^7,H78*I78*10^7)>30000000,30000000,IF(J78<>0,H78*I78*J78*10^7,H78*I78*10^7)))","v":1000000},null,1000000]
[73,"TVTDHSMQTXD-1","Chi phí thẩm định hồ sơ mời quan tâm, hồ sơ mời sơ tuyển gói thầu thi công xây dựng (NĐ 63/2014-CP)",null,null,null,null,null,0.03,null,{"$f":"IF(IF(J79<>0,H79*I79*J79*10^7,H79*I79*10^7)<1000000,1000000,IF(IF(J79<>0,H79*I79*J79*10^7,H79*I79*10^7)>30000000,30000000,IF(J79<>0,H79*I79*J79*10^7,H79*I79*10^7)))","v":1000000},null,1000000]
[74,"TVTDHSMQTTB-1","Chi phí thẩm định hồ sơ mời quan tâm, hồ sơ mời sơ tuyển gói thầu mua sắm, lắp đặt thiết bị (NĐ 63/2014-CP)",null,null,null,null,null,0.03,null,{"$f":"IF(IF(J80<>0,H80*I80*J80*10^7,H80*I80*10^7)<1000000,1000000,IF(IF(J80<>0,H80*I80*J80*10^7,H80*I80*10^7)>30000000,30000000,IF(J80<>0,H80*I80*J80*10^7,H80*I80*10^7)))","v":1000000},null,1000000]
[75,"TVLHSMTXD-1","Chi phí lập hồ sơ mời thầu, hồ sơ yêu cầu gói thầu thi công xây dựng (NĐ 63/2014-CP)",null,null,null,null,null,0.1,null,{"$f":"IF(IF(J81<>0,H81*I81*J81*10^7,H81*I81*10^7)<1000000,1000000,IF(IF(J81<>0,H81*I81*J81*10^7,H81*I81*10^7)>50000000,50000000,IF(J81<>0,H81*I81*J81*10^7,H81*I81*10^7)))","v":1000000},null,1000000]
[76,"TVLHSMTTB-1","Chi phí lập hồ sơ mời thầu, hồ sơ yêu cầu gói thầu mua sắm, lắp đặt thiết bị (NĐ 63/2014-CP)",null,null,null,null,null,0.1,null,1000000,null,1000000]
[77,"TVDGHSQTXD-1","Chi phí đánh giá hồ sơ quan tâm, hồ sơ dự sơ tuyển gói thầu thi công xây dựng (NĐ 63/2014-CP)",null,null,null,null,null,0.05,null,{"$f":"IF(IF(J83<>0,H83*I83*J83*10^7,H83*I83*10^7)<1000000,1000000,IF(IF(J83<>0,H83*I83*J83*10^7,H83*I83*10^7)>30000000,30000000,IF(J83<>0,H83*I83*J83*10^7,H83*I83*10^7)))","v":1000000},null,1000000]
[78,"TVDGHSQTTB-1","Chi phí đánh giá hồ sơ quan tâm, hồ sơ dự sơ tuyển gói thầu mua sắm, lắp đặt thiết bị (NĐ 63/2014-CP)",null,null,null,null,null,0.05,null,{"$f":"IF(IF(J84<>0,H84*I84*J84*10^7,H84*I84*10^7)<1000000,1000000,IF(IF(J84<>0,H84*I84*J84*10^7,H84*I84*10^7)>30000000,30000000,IF(J84<>0,H84*I84*J84*10^7,H84*I84*10^7)))","v":1000000},null,1000000]
[79,"TVDGHSDTXD-1","Chi phí đánh giá hồ sơ dự thầu, hồ sơ đề xuất gói thầu thi công xây dựng (NĐ 63/2014-CP)",null,null,null,null,null,0.01,null,1000000,null,1000000]
[80,"TVDGHSDTTB-1","Chi phí đánh giá hồ sơ dự thầu, hồ sơ đề xuất gói thầu mua sắm, lắp đặt thiết bị (NĐ 63/2014-CP)",null,null,null,null,null,0.1,null,1000000,null,1000000]
[81,"TVTDKQLCNTXD-1","Chi phí thẩm định kết quả lựa chọn nhà thầu gói thầu thi công xây dựng (NĐ 63/2014-CP)",null,null,null,null,null,0.05,null,1000000,null,1000000]
[82,"TVTDKQLCNTTB-1","Chi phí thẩm định kết quả lựa chọn nhà thầu gói thầu mua sắm, lắp đặt thiết bị (NĐ 63/2014-CP)",null,null,null,null,null,0.05,null,1000000,null,1000000]
[83,"TVLDMXD","Chi phí lập định mức xây dựng công trình"]
[84,"TVTTrDMXD","Chi phí thẩm tra định mức xây dựng công trình"]
[85,"TVLDGXD","Chi phí lập đơn giá xây dựng công trình"]
[86,"TVTTrDGXD","Chi phí thẩm tra đơn giá xây dựng công trình"]
[87,"TVLCSG","Chi phí lập chỉ số giá xây dựng"]
[88,"TVTTrCSG","Chi phí thẩm tra chỉ số giá xây dựng"]
[89,"TVGSXD","Chi phí giám sát thi công xây dựng",{"$f":"IF(H95<=MIN($T$303:$AD$303),MIN($T$303:$AD$303),LOOKUP(H95,$T$303:$AD$303))","v":10},{"$f":"IF(H95<=MIN($T$303:$AD$303),$D95,INDEX($T$303:$AD$303,0,IF(H95=MAX($T$303:$AD$303),MATCH($D95,$T$303:$AD$303,0),MATCH($D95,$T$303:$AD$303,0)+1)))","v":10},{"$f":"HLOOKUP(D95,Data_GSTC,LCT_+1,0)","v":3.2850000000000001},{"$f":"HLOOKUP(E95,Data_GSTC,LCT_+1,0)","v":3.2850000000000001},{"$f":"XD_","v":0},{"$f":"IF($D95=$E95,$F95,FORECAST(H95,$F95:$G95,$D95:$E95))","v":3.2850000000000001},null,{"$f":"IF(J95<>0,H95*I95*J95*10^7,H95*I95*10^7)","v":0},{"$f":"10%*K95","v":0},{"$f":"K95+L95","v":0},null,null,null,{"$f":"IF(XD_>0,\"TRUE\")","v":false}]
[90,"TVGSTB","Chi phí giám sát lắp đặt thiết bị",{"$f":"IF(H96<=MIN($T$303:$AD$303),MIN($T$303:$AD$303),LOOKUP(H96,$T$303:$AD$303))","v":10},{"$f":"IF(H96<=MIN($T$303:$AD$303),$D96,INDEX($T$303:$AD$303,0,IF(H96=MAX($T$303:$AD$303),MATCH($D96,$T$303:$AD$303,0),MATCH($D96,$T$303:$AD$303,0)+1)))","v":10},{"$f":"HLOOKUP(D96,Data_GSLD,LCT_+1,0)","v":0.84399999999999997},{"$f":"HLOOKUP(E96,Data_GSLD,LCT_+1,0)","v":0.84399999999999997},{"$f":"TB_","v":0},{"$f":"IF($D96=$E96,$F96,FORECAST(H96,$F96:$G96,$D96:$E96))","v":0.84399999999999997},null,0,{"$f":"10%*K96","v":0},0,null,null,null,{"$f":"IF(TB_>0,\"TRUE\")","v":false}]
[91,"TVKSCP","Chi phí kiểm soát chi phí đầu tư xây dựng công trình"]
[92,"TVQLCPDT","Chi phí quản lý chi phí đầu tư xây dựng"]
[93,"TVTTrDBATGT","Chi phí thẩm tra công tác đảm bảo an toàn giao thông"]
[94,"TVTVQLDA","Chi phí tư vấn quản lý dự án (trường hợp thuê tư vấn)"]
[95,"TVTNCN","Chi phí thí nghiệm chuyên ngành"]
[96,"TVKTCLVL","Chi phí kiểm tra chất lượng vật liệu, cấu kiện, sản phẩm xây dựng, thiết bị lắp đặt vào công trình theo yêu cầu của Chủ đầu tư"]
[97,"TVKDCLXD","Chi phí kiểm định chất lượng xây dựng"]
[98,"TVQDVDT-1","Chi phí quy đổi vốn đầu tư xây dựng",{"$f":"IF(H104<=MIN($T$372:$Z$372),MIN($T$372:$Z$372),LOOKUP(H104,$T$372:$Z$372))","v":100},{"$f":"IF(H104<=MIN($T$372:$Z$372),$D104,INDEX($T$372:$Z$372,0,IF(H104>=MAX($T$372:$Z$372),MATCH($D104,$T$372:$Z$372,0),MATCH($D104,$T$372:$Z$372,0)+1)))","v":100},{"$f":"HLOOKUP(D104,QDV_,2,0)","v":0.109},{"$f":"HLOOKUP(E104,QDV_,2,0)","v":0.109},null,{"$f":"IF($D104=$E104,$F104,FORECAST(H104,$F104:$G104,$D104:$E104))","v":0.109},null,{"$f":"IF(J104<>0,H104*I104*J104*10^7,H104*I104*10^7)","v":0},{"$f":"10%*K104","v":0},{"$f":"K104+L104","v":0}]
[99,"TVK","Chi phí các công việc tư vấn khác"]
[100,"KRP","Chi phí rà phá bom mìn, vật nổ"]
[101,"KTDDA","Phí thẩm định dự án đầu tư xây dựng",{"$f":"IF(H107<=MIN($T$386:$AC$386),MIN($T$386:$AC$386),LOOKUP(H107,$T$386:$AC$386))","v":15},{"$f":"IF(H107<=MIN($T$386:$AC$386),$D107,INDEX($T$386:$AC$386,0,IF(H107>=MAX($T$386:$AC$386),MATCH($D107,$T$386:$AC$386,0),MATCH($D107,$T$386:$AC$386,0)+1)))","v":15},{"$f":"HLOOKUP(D107,$T$386:$AC$387,2,0)","v":1.9E-2},{"$f":"HLOOKUP(E107,$T$386:$AC$387,2,0)","v":1.9E-2},{"$f":"TMDT_","v":0},{"$f":"IF($D107=$E107,$F107,FORECAST(TMDT_,$F107:$G107,$D107:$E107))","v":1.9E-2},null,{"$f":"IF(IF(J107<>0,H107*I107*J107*10^7,H107*I107*10^7)>150000000,150000000,IF(J107<>0,H107*I107*J107*10^7,H107*I107*10^7))","v":0},null,{"$f":"K107+L107","v":0},null,null,null,true,{"$f":"IF(IF(J107<>0,H107*I107*J107*10^7,H107*I107*10^7)>150*10^6,\"Không quá 150.000.000 đồng\",\"\")","v":""}]
[102,"KTDTKCS","Phí thẩm định thiết kế cơ sở ",null,null,null,null,{"$f":"H107","v":0},{"$f":"I107/2","v":9.4999999999999998E-3},null,{"$f":"IF(J108<>0,H108*I108*J108*10^7,H108*I108*10^7)","v":0},null,{"$f":"K108+L108","v":0}]
[103,"KTTrTKNN","Phí thẩm định thiết kế xây dựng công trình",{"$f":"IF(H109<=MIN($T$394:$AB$394),MIN($T$394:$AB$394),LOOKUP(H109,$T$394:$AB$394))","v":15},{"$f":"IF(H109<=MIN($T$394:$AB$394),$D109,INDEX($T$394:$AB$394,0,IF(H109>=MAX($T$394:$AB$394),MATCH($D109,$T$394:$AB$394,0),MATCH($D109,$T$394:$AB$394,0)+1)))","v":15},{"$f":"HLOOKUP(D109,$T$394:$AB$399,N109+1,0)","v":0.16500000000000001},{"$f":"HLOOKUP(E109,$T$394:$AB$399,N109+1,0)","v":0.16500000000000001},{"$f":"XD_","v":0},{"$f":"IF($D109=$E109,$F109,FORECAST(H109,$F109:$G109,$D109:$E109))","v":0.16500000000000001},null,{"$f":"IF(J109<>0,H109*I109*J109*10^7,H109*I109*10^7)","v":0},null,{"$f":"K109+L109","v":0},1,null,null,{"$f":"IF(BTK_>1,\"TRUE\",\"FALSE\")","v":"TRUE"}]
[104,"KTTrDTNN","Phí thẩm định dự toán xây dựng công trình",{"$f":"IF(H110<=MIN($T$394:$AB$394),MIN($T$394:$AB$394),LOOKUP(H110,$T$394:$AB$394))","v":15},{"$f":"IF(XD_<=MIN($T$394:$AB$394),$D110,INDEX($T$394:$AB$394,0,IF(XD_>=MAX($T$394:$AB$394),MATCH($D110,$T$394:$AB$394,0),MATCH($D110,$T$394:$AB$394,0)+1)))","v":15},{"$f":"HLOOKUP(D110,$T$403:$AB$408,LCT_+1,0)","v":0.16},{"$f":"HLOOKUP(E110,$T$403:$AB$408,LCT_+1,0)","v":0.16},{"$f":"XD_","v":0},{"$f":"IF($D110=$E110,$F110,FORECAST(H110,$F110:$G110,$D110:$E110))","v":0.16},null,{"$f":"IF(J110<>0,H110*I110*J110*10^7,H110*I110*10^7)","v":0},null,{"$f":"K110+L110","v":0},1,null,null,{"$f":"IF(BTK_>1,\"TRUE\",\"FALSE\")","v":"TRUE"}]
[105,"KTTrTKNNCN","Phí thẩm định thiết kế xây dựng công trình khi cơ quan quản lý nhà nước thuê tổ chức tư vấn, cá nhân cùng thẩm định",{"$f":"IF(XD_<=MIN($T$394:$AB$394),MIN($T$394:$AB$394),LOOKUP(XD_,$T$394:$AB$394))","v":15},{"$f":"IF(XD_<=MIN($T$394:$AB$394),$D111,INDEX($T$394:$AB$394,0,IF(XD_>=MAX($T$394:$AB$394),MATCH($D111,$T$394:$AB$394,0),MATCH($D111,$T$394:$AB$394,0)+1)))","v":15},{"$f":"HLOOKUP(D111,$T$414:$AB$419,LCT_+1,0)","v":4.9500000000000002E-2},{"$f":"HLOOKUP(E111,$T$414:$AB$419,LCT_+1,0)","v":4.9500000000000002E-2},{"$f":"XD_","v":0},{"$f":"IF($D111=$E111,$F111,FORECAST(H111,$F111:$G111,$D111:$E111))","v":4.9500000000000002E-2},null,{"$f":"IF(J111<>0,H111*I111*J111*10^7,H111*I111*10^7)","v":0},null,0,1]
[106,"KTTrDTNNCN","Phí thẩm định dự toán xây dựng công trình khi cơ quan quản lý nhà nước thuê tổ chức tư vấn, cá nhân cùng thẩm định",{"$f":"IF(XD_<=MIN($T$394:$AB$394),MIN($T$394:$AB$394),LOOKUP(XD_,$T$394:$AB$394))","v":15},{"$f":"IF(XD_<=MIN($T$394:$AB$394),$D112,INDEX($T$394:$AB$394,0,IF(XD_>=MAX($T$394:$AB$394),MATCH($D112,$T$394:$AB$394,0),MATCH($D112,$T$394:$AB$394,0)+1)))","v":15},{"$f":"HLOOKUP(D112,$T$423:$AB$428,LCT_+1,0)","v":4.8000000000000001E-2},{"$f":"HLOOKUP(E112,$T$423:$AB$428,LCT_+1,0)","v":4.8000000000000001E-2},{"$f":"XD_","v":0},{"$f":"IF($D112=$E112,$F112,FORECAST(H112,$F112:$G112,$D112:$E112))","v":4.8000000000000001E-2},null,{"$f":"IF(J112<>0,H112*I112*J112*10^7,H112*I112*10^7)","v":0},null,0,1]
[107,"KBH","Chi phí bảo hiểm công trình trong thời gian xây dựng",null,null,null,null,null,null,null,null,null,null,null,null,null,true]
[108,"KDKCLQT","Chi phí đăng kiểm chất lượng quốc tế, quan trắc biến dạng công trình"]
[109,"KTTrPDQT","Chi phí thẩm tra, phê duyệt quyết toán dự án hoàn thành",{"$f":"IF(H115<=MIN($T$379:$Z$379),MIN($T$379:$Z$379),LOOKUP(H115,$T$379:$Z$379))","v":5},{"$f":"IF(H115<=MIN($T$379:$Z$379),$D115,INDEX($T$379:$Z$379,0,IF(H115>=MAX($T$379:$Z$379),MATCH($D115,$T$379:$Z$379,0),MATCH($D115,$T$379:$Z$379,0)+1)))","v":5},{"$f":"HLOOKUP(D115,$T$379:$Z$381,2,0)","v":0.56999999999999995},{"$f":"HLOOKUP(E115,$T$379:$Z$381,2,0)","v":0.56999999999999995},{"$f":"TMDT_","v":0},{"$f":"IF($D115=$E115,$F115,FORECAST(TMDT_,$F115:$G115,$D115:$E115))","v":0.56999999999999995},null,{"$f":"IF(J115<>0,H115*I115*J115*10^7,H115*I115*10^7)","v":0},null,{"$f":"K115+L115","v":0},null,null,null,true]
[110,"KKTDL","Chi phí kiểm toán độc lập",{"$f":"IF(H116<=MIN($T$379:$Z$379),MIN($T$379:$Z$379),LOOKUP(H116,$T$379:$Z$379))","v":5},{"$f":"IF(H116<=MIN($T$379:$Z$379),$D116,INDEX($T$379:$Z$379,0,IF(H116>=MAX($T$379:$Z$379),MATCH($D116,$T$379:$Z$379,0),MATCH($D116,$T$379:$Z$379,0)+1)))","v":5},{"$f":"HLOOKUP(D116,$T$379:$Z$381,3,0)","v":0.96},{"$f":"HLOOKUP(E116,$T$379:$Z$381,3,0)","v":0.96},{"$f":"TMDT_","v":0},{"$f":"IF($D116=$E116,$F116,FORECAST(TMDT_,$F116:$G116,$D116:$E116))","v":0.96},null,0,{"$f":"10%*K116","v":0},0,null,null,null,true]
[111,"KPCCC","Lệ phí thẩm duyệt PCCC",{"$f":"IF(H117<=MIN($T$433:$Y$433),MIN($T$433:$Y$433),LOOKUP(H117,$T$433:$Y$433))","v":15},{"$f":"IF(H117<=MIN($T$433:$Y$433),$D117,INDEX($T$433:$Y$433,0,IF(H117>=MAX($T$433:$Y$433),MATCH($D117,$T$433:$Y$433,0),MATCH($D117,$T$433:$Y$433,0)+1)))","v":15},{"$f":"HLOOKUP(D117,$T$433:$Y$437,IF(OR(LCT_=1,LCT_=2),4,IF(OR(LCT_=3,LCT_=5),2,IF(LCT_=4,5,3))),0)","v":9.6699999999999998E-3},{"$f":"HLOOKUP(E117,$T$433:$Y$437,IF(OR(LCT_=1,LCT_=2),4,IF(OR(LCT_=3,LCT_=5),2,IF(LCT_=4,5,3))),0)","v":9.6699999999999998E-3},{"$f":"TMDT_","v":0},{"$f":"IF($D117=$E117,$F117,FORECAST(TMDT_,$F117:$G117,$D117:$E117))","v":9.6699999999999998E-3},null,0,null,0,null,null,null,true]
[112,"KKTNT","Chi phí kiểm tra công tác nghiệm thu trong quá trình thi công xây dựng và khi nghiệm thu hoàn thành hạng mục công trình, công trình của cơ quan quản lý nhà nước có thẩm quyền"]
[113,"KNCKH","Chi phí nghiên cứu khoa học công nghệ liên quan đến dự án"]
[114,"KLV","Chi phí vốn lưu động ban đầu đối với các dự án đầu tư xây dựng nhằm mục đích kinh doanh, lãi vay trong thời gian xây dựng"]
[115,"KCT","Chi phí cho quá trình chạy thử không tải và có tải theo quy trình công nghệ trước khi bàn giao (trừ giá trị sản phẩm thu hồi được)"]
[116,"KTTN","Chi phí các khoản thuế tài nguyên, phí và lệ phí theo quy định"]
[117,"KK","Các chi phí thực hiện các công việc khác."]
[]
[null,null,null,null,null,null,null,null,null,null,null,null,null,null,null,null,null,null,null,null,null,null,null,null,null,null,null,null,null,null,null,null,null,null,null,null,null,null,null,null,null,null,null,null,null,null,{"$f":"Options!$N$21","v":1}]
[null,null,null,null,null,null,null,null,null,null,null,null,null,null,null,null,null,null,null,null,null,null,null,null,null,null,null,null,null,null,null,null,null,null,null,null,null,null,null,null,null,null,null,null,null,null,"Loại dự án"]
[null,null,null,null,null,null,null,null,null,null,null,null,null,null,null,null,null,"Bảng số 1.1: Định mức chi phí quản lý dự án",null,null,null,null,null,null,null,null,null,null,null,null,null,null,null,null,null,null,null,null,null,null,null,null,null,null,null,null,"Dự án thường"]
[null,null,null,null,null,null,null,null,null,null,null,null,null,null,null,null,null,null,null,null,null,null,null,null,null,null,null,null,null,null,null,null,null,null,null,null,null,null,null,null,null,null,null,null,null,null,"Dự án PPP"]
[null,null,null,null,null,null,null,null,null,null,null,null,null,null,null,null,null,"TT","Loại công trình","Chi phí xây dựng và thiết bị (chưa có thuế GTGT) (tỷ đồng)",null,null,null,null,null,null,null,null,null,null,null,null,null,null,null,null,null,null,null,null,null,null,null,null,null,null,{"$f":"Options!$N$12","v":1},2,2,3,3]
[null,null,null,null,null,null,null,null,null,null,null,null,null,null,null,null,null,null,null,10,20,50,100,200,500,1000,2000,5000,10000,20000,30000,null,null,null,null,null,null,null,null,null,null,null,null,null,null,null,"Loại công trình","Loại báo cáo","Số bước thiết kế","Cấp công trình","Giai đoạn tính toán"]
[null,null,null,null,null,null,null,null,null,null,null,null,null,null,null,null,null,1,"Công trình dân dụng",3.4460000000000002,2.923,2.61,2.0169999999999999,1.8859999999999999,1.514,1.2390000000000001,0.95799999999999996,0.71099999999999997,0.51,0.38100000000000001,0.30499999999999999,null,null,null,null,null,null,null,null,null,null,null,null,null,null,null,"Công trình dân dụng","Báo cáo nghiên cứu tiền khả thi","Thiết kế 1 bước","Cấp đặc biệt","Sơ bộ Tổng mức đầu tư"]
[null,null,null,null,null,null,null,null,null,null,null,null,null,null,null,null,null,2,"Công trình công nghiệp",3.5569999999999999,3.0179999999999998,2.694,2.0819999999999999,1.9470000000000001,1.5640000000000001,1.2789999999999999,1.103,0.73399999999999999,0.52700000000000002,0.39300000000000002,0.31400000000137002,null,null,null,null,null,null,null,null,null,null,null,null,null,null,null,"Công trình công nghiệp","Báo cáo nghiên cứu khả thi","Thiết kế 2 bước","Cấp I","Tổng mức đầu tư"]
[null,null,null,null,null,null,null,null,null,null,null,null,null,null,null,null,null,3,"Công trình giao thông",3.024,2.5659999999999998,2.2919999999999998,1.7709999999999999,1.655,1.329,1.0880000000000001,0.93700000000000006,0.624,0.44800000000000001,0.33500000000000002,0.26800000000000002,null,null,null,null,null,null,null,null,null,null,null,null,null,null,null,"Công trình giao thông","Báo cáo kinh tế - kỹ thuật","Thiết kế 3 bước","Cấp II","Dự toán xây dựng công trình"]
[null,null,null,null,null,null,null,null,null,null,null,null,null,null,null,null,null,4,"Công trình nông nghiệp và phát triển nông thôn",3.2629999999999999,2.7690000000000001,2.4729999999999999,1.91,1.786,1.4339999999999999,1.1739999999999999,1.012,0.67400000000000004,0.48399999999999999,0.36100000000137,0.28899999999999998,null,null,null,null,null,null,null,null,null,null,null,null,null,null,null,"Công trình nông nghiệp và phát triển nông thôn",null,null,"Cấp III"]
[null,null,null,null,null,null,null,null,null,null,null,null,null,null,null,null,null,5,"Công trình hạ tầng kỹ thuật",2.9009999999999998,2.4609999999999999,2.198,1.593,1.56,1.2749999999999999,1.071,0.89900000000000002,0.59899999999999998,0.42899999999999999,0.32100000000000001,0.25700000000000001,null,null,null,null,null,null,null,null,null,null,null,null,null,null,null,"Công trình hạ tầng kỹ thuật",null,null,"Cấp IV"]
[]
[null,null,null,null,null,null,null,null,null,null,null,null,null,null,null,null,null,"Bảng số 1.2: Định mức chi phí hoạt động của đơn vị quản lý dự án thuộc Cơ quan nhà nước có thẩm quyền thực hiện dự án theo hình thức đối tác công tư (PPP)"]
[null,null,null,null,null,null,null,null,null,null,null,null,null,null,null,null,null,"(Thông tư 16/2019/TT-BXD)"]
[null,null,null,null,null,null,null,null,null,null,null,null,null,null,null,null,null,"TT","Loại công trình","Chi phí xây dựng và thiết bị (chưa có thuế GTGT) (tỷ đồng)"]
[null,null,null,null,null,null,null,null,null,null,null,null,null,null,null,null,null,null,null,50,100,200,500,1000,2000,5000,10000,20000,30000]
[null,null,null,null,null,null,null,null,null,null,null,null,null,null,null,null,null,1,"Công trình dân dụng",1.113,0.76400000000000001,0.71399999999999997,0.57299999999999995,0.46899999999999997,0.40400000000000003,0.20200000000000001,0.14499999999999999,0.105,8.4000000000000005E-2]
[null,null,null,null,null,null,null,null,null,null,null,null,null,null,null,null,null,2,"Công trình công nghiệp",1.1779999999999999,0.80900000000000005,0.75600000000000001,0.60699999999999998,0.497,0.42799999999999999,0.214,0.154,0.111,8.7999999999999995E-2]
[null,null,null,null,null,null,null,null,null,null,null,null,null,null,null,null,null,3,"Công trình giao thông",1.0009999999999999,0.68799999999999994,0.64300000000000002,0.51600000000000001,0.44500000000000001,0.38500000000000001,0.17799999999999999,0.13100000000000001,9.4E-2,7.4999999999999997E-2]
[null,null,null,null,null,null,null,null,null,null,null,null,null,null,null,null,null,4,"Công trình nông nghiệp và phát triển nông thôn",1.0649999999999999,0.73099999999999998,0.68400000000000005,0.54900000000000004,0.45,0.38800000000000001,0.193,0.13900000000000001,0.1,0.08]
[null,null,null,null,null,null,null,null,null,null,null,null,null,null,null,null,null,5,"Công trình hạ tầng kỹ thuật",0.94499999999999995,0.64900000000000002,0.60599999999999998,0.48699999999999999,0.39800000000000002,0.34300000000000003,0.17199999999999999,0.123,8.8999999999999996E-2,7.0999999999999994E-2]
[]
[null,null,null,null,null,null,null,null,null,null,null,null,null,null,null,null,null,"Bảng số 2.1: Định mức chi phí lập báo cáo nghiên cứu tiền khả thi"]
[]
[null,null,null,null,null,null,null,null,null,null,null,null,null,null,null,null,null,"TT","Loại công trình","Chi phí xây dựng và thiết bị (chưa có thuế GTGT) trong tổng mức đầu tư được duyệt (tỷ đồng)"]
[null,null,null,null,null,null,null,null,null,null,null,null,null,null,null,null,null,null,null,15,20,50,100,200,500,1000,2000,5000,10000,20000,30000]
[null,null,null,null,null,null,null,null,null,null,null,null,null,null,null,null,null,1,"Công trình dân dụng",0.66800000000000004,0.503,0.376,0.24,0.161,0.1,8.5999999999999993E-2,7.2999999999999995E-2,0.05,0.04,2.5999999999999999E-2,2.1999999999999999E-2]
[null,null,null,null,null,null,null,null,null,null,null,null,null,null,null,null,null,2,"Công trình công nghiệp",0.75700000000000001,0.61199999999999999,0.441,0.29399999999999998,0.20599999999999999,0.16300000000000001,0.14099999999999999,0.11,7.3999999999999996E-2,5.7000000000000002E-2,3.4000000000000002E-2,2.7E-2]
[null,null,null,null,null,null,null,null,null,null,null,null,null,null,null,null,null,3,"Công trình giao thông",0.41299999999999998,0.34499999999999997,0.251,0.17699999999999999,0.108,7.0999999999999994E-2,6.2E-2,5.2999999999999999E-2,3.5999999999999997E-2,2.9000000000000001E-2,1.9E-2,1.6E-2]
[null,null,null,null,null,null,null,null,null,null,null,null,null,null,null,null,null,4,"Công trình nông nghiệp và phát triển nông thôn",0.56599999999999995,0.47199999999999998,0.34300000000000003,0.216,0.14399999999999999,9.6000000000000002E-2,8.2000000000000003E-2,7.0000000000000007E-2,4.8000000000000001E-2,3.9E-2,2.5000000000000001E-2,2.1000000000000001E-2]
[null,null,null,null,null,null,null,null,null,null,null,null,null,null,null,null,null,5,"Công trình hạ tầng kỹ thuật",0.43099999999999999,0.36,0.26200000000000001,0.183,0.112,7.3999999999999996E-2,6.5000000000000002E-2,5.5E-2,3.7999999999999999E-2,0.03,0.02,1.7000000000001299E-2]
[]
[null,null,null,null,null,null,null,null,null,null,null,null,null,null,null,null,null,"Bảng số 2.2: Định mức chi phí lập báo cáo nghiên cứu khả thi"]
[]
[null,null,null,null,null,null,null,null,null,null,null,null,null,null,null,null,null,"TT","Loại công trình","Chi phí xây dựng và thiết bị (chưa có thuế GTGT) (tỷ đồng)"]
[null,null,null,null,null,null,null,null,null,null,null,null,null,null,null,null,null,null,null,15,20,50,100,200,500,1000,2000,5000,10000,20000,30000]
[null,null,null,null,null,null,null,null,null,null,null,null,null,null,null,null,null,1,"Công trình dân dụng",1.1140000000000001,0.91400000000000003,0.751,0.53400000000000003,0.40200000000000002,0.28699999999999998,0.246,0.20899999999999999,0.16700000000000001,0.13400000000000001,0.10199999999999999,8.5999999999999993E-2]
[null,null,null,null,null,null,null,null,null,null,null,null,null,null,null,null,null,2,"Công trình công nghiệp",1.2609999999999999,1.1120000000000001,0.88200000000000001,0.65400000000000003,0.51500000000000001,0.46600000000000003,0.40400000000000003,0.315,0.248,0.189,0.13500000000000001,0.107]
[null,null,null,null,null,null,null,null,null,null,null,null,null,null,null,null,null,3,"Công trình giao thông",0.68899999999999995,0.628,0.501,0.39300000000000002,0.27100000000000002,0.20300000000000001,0.17699999999999999,0.151,0.12,9.7000000000000003E-2,7.4999999999999997E-2,6.3E-2]
[null,null,null,null,null,null,null,null,null,null,null,null,null,null,null,null,null,4,"Công trình nông nghiệp và phát triển nông thôn",0.94299999999999995,0.85799999999999998,0.68500000000000005,0.48,0.36099999999999999,0.27300000000000002,0.23400000000000001,0.20100000000000001,0.161,0.129,0.1,8.4000000000000005E-2]
[null,null,null,null,null,null,null,null,null,null,null,null,null,null,null,null,null,5,"Công trình hạ tầng kỹ thuật",0.71899999999999997,0.65400000000000003,0.52400000000000002,0.40699999999999997,0.28000000000000003,0.21099999999999999,0.185,0.158,0.127,0.10100000000000001,7.8E-2,6.5000000000000002E-2]
[]
[null,null,null,null,null,null,null,null,null,null,null,null,null,null,null,null,null,"Bảng số 2.3: Định mức chi phí lập báo cáo kinh tế - kỹ thuật"]
[]
[null,null,null,null,null,null,null,null,null,null,null,null,null,null,null,null,null,"TT","Loại công trình","Chi phí xây dựng và thiết bị (chưa có thuế GTGT) (tỷ đồng)"]
[null,null,null,null,null,null,null,null,null,null,null,null,null,null,null,null,null,null,null,1,3,7,15]
[null,null,null,null,null,null,null,null,null,null,null,null,null,null,null,null,null,1,"Công trình dân dụng",6.5,4.7,4.2,3.6]
[null,null,null,null,null,null,null,null,null,null,null,null,null,null,null,null,null,2,"Công trình công nghiệp",6.7,4.8,4.3,3.8]
[null,null,null,null,null,null,null,null,null,null,null,null,null,null,null,null,null,3,"Công trình giao thông",5.4,3.6,2.7,2.5]
[null,null,null,null,null,null,null,null,null,null,null,null,null,null,null,null,null,4,"Công trình nông nghiệp và phát triển nông thôn",6.2,4.4000000000000004,3.9,3.6]
[null,null,null,null,null,null,null,null,null,null,null,null,null,null,null,null,null,5,"Công trình hạ tầng kỹ thuật",5.8,4.2,3.4,3]
[null,null,null,null,null,null,null,null,null,null,null,null,null,null,null,null,null,"Lưu ý khi áp dụng định mức chi phỉ lập báo cáo kinh tế - kỹ thuật: Chi phí lập báo cáo kinh tế - kỹ thuật xác định theo định mức nhưng tối thiểu không nhỏ hơn 5.000.000 đồng. "]
[]
[null,null,null,null,null,null,null,null,null,null,null,null,null,null,null,null,null,"Bảng số 2.4: Định mức chi phí thiết kế kỹ thuật của công trình dân dụng có yêu cầu thiết kế 3 bước"]
[]
[null,null,null,null,null,null,null,null,null,null,null,null,null,null,null,null,null,"TT","Cấp công trình","Chi phí xây dựng (chưa có thuế GTGT) (tỷ đồng)",null,null,null,null,null,null,null,null,null,null,null,null,"Bảng DD1"]
[null,null,null,null,null,null,null,null,null,null,null,null,null,null,null,null,null,null,null,10,20,50,100,200,500,1000,2000,5000,8000,10000,null,null,"Chi phí thiết bị (tỷ đồng)",5,15,25,50,100,200,500,1000,3000]
[null,null,null,null,null,null,null,null,null,null,null,null,null,null,null,null,null,1,"Cấp đặc biệt",3.22,2.81,2.36,2.15,1.96,1.65,1.36,1.1599999999999999,0.89,0.68,0.61,null,null,"Tỷ lệ %",0.6,0.5,0.45,0.4,0.36,0.33,0.28000000000000003,0.22,0.16]
[null,null,null,null,null,null,null,null,null,null,null,null,null,null,null,null,null,2,"Cấp I",2.93,2.5499999999999998,2.14,1.94,1.78,1.5,1.22,1.05,0.8,0.61,0.55000000000000004]
[null,null,null,null,null,null,null,null,null,null,null,null,null,null,null,null,null,3,"Cấp II",2.67,2.33,1.96,1.77,1.62,1.37,1.1100000000000001,0.94,0.73,0.55000000000000004,0.5]
[null,null,null,null,null,null,null,null,null,null,null,null,null,null,null,null,null,4,"Cấp III",2.36,2.0699999999999998,1.74,1.57,1.43,1.21,0.98,0.83,0.64,0.48,0.44]
[null,null,null,null,null,null,null,null,null,null,null,null,null,null,null,null,null,5,"Cấp IV",2.0699999999999998,1.81,1.48,1.3,1.06,0.89]
[]
[null,null,null,null,null,null,null,null,null,null,null,null,null,null,null,null,null,"Bảng số 2.5: Định mức chi phí thiết kế bản vẽ thi công của công trình dân dụng có yêu cầu thiết kế 2 bước"]
[]
[null,null,null,null,null,null,null,null,null,null,null,null,null,null,null,null,null,"TT","Cấp công trình","Chi phí xây dựng (chưa có thuế GTGT) (tỷ đồng)"]
[null,null,null,null,null,null,null,null,null,null,null,null,null,null,null,null,null,null,null,10,20,50,100,200,500,1000,2000,5000,8000,10000]
[null,null,null,null,null,null,null,null,null,null,null,null,null,null,null,null,null,1,"Cấp đặc biệt",4.66,4.05,3.41,3.1,2.83,2.39,1.93,1.65,1.28,0.99,0.91]
[null,null,null,null,null,null,null,null,null,null,null,null,null,null,null,null,null,2,"Cấp I",4.22,3.66,3.1,2.82,2.57,2.17,1.76,1.51,1.1599999999999999,0.9,0.8]
[null,null,null,null,null,null,null,null,null,null,null,null,null,null,null,null,null,3,"Cấp II",3.85,3.33,2.8,2.54,2.34,1.98,1.61,1.36,1.06,0.82,0.72]
[null,null,null,null,null,null,null,null,null,null,null,null,null,null,null,null,null,4,"Cấp III",3.41,2.95,2.48,2.25,2.0699999999999998,1.75,1.43,1.2,0.94,0.72,0.63]
[null,null,null,null,null,null,null,null,null,null,null,null,null,null,null,null,null,5,"Cấp IV",2.92,2.5499999999999998,2.12,1.86,1.51,1.3]
[]
[]
[null,null,null,null,null,null,null,null,null,null,null,null,null,null,null,null,null,"Bảng số 2.6: Định mức chi phí thiết kế kỹ thuật của công trình công nghiệp có yêu cầu thiết kế 3 bước"]
[null,null,null,null,null,null,null,null,null,null,null,null,null,null,null,null,null,null,null,null,null,null,null,null,null,null,null,null,null,null,null,null,"Bảng CN1"]
[null,null,null,null,null,null,null,null,null,null,null,null,null,null,null,null,null,"TT","Cấp công trình","Chi phí xây dựng (chưa có thuế GTGT) (tỷ đồng)"]
[null,null,null,null,null,null,null,null,null,null,null,null,null,null,null,null,null,null,null,10,20,50,100,200,500,1000,2000,5000,8000,10000,null,null,"Cấp điện áp/ CP XD và TB (tỷ đồng)",5,15,25,50,100,200,500]
[null,null,null,null,null,null,null,null,null,null,null,null,null,null,null,null,null,1,"Cấp đặc biệt",2.96,2.73,2.34,2.13,1.92,1.76,1.54,1.3,0.97,0.79,0.7,null,null,"Cáp ngầm điện áp < 6KV",1.7,1.4,1.3,1.2,1.1000000000000001,0.95,0.85]
[null,null,null,null,null,null,null,null,null,null,null,null,null,null,null,null,null,2,"Cấp I",2.4700000000000002,2.27,1.93,1.77,1.6,1.46,1.28,1.0900000000000001,0.8,0.65,0.57999999999999996,null,null,"Cấp ngầm điện áp 6 - 110KV",1.9,1.6,1.45,1.3,1.2,1.05,0.95]
[null,null,null,null,null,null,null,null,null,null,null,null,null,null,null,null,null,3,"Cấp II",2.0299999999999998,1.86,1.59,1.46,1.32,1.2,1.05,0.9,0.66,0.53,0.48,null,null,"Cáp ngầm điện áp 220KV",1.65,1.43,1.27,1.1599999999999999,1.05,0.94,0.83]
[null,null,null,null,null,null,null,null,null,null,null,null,null,null,null,null,null,4,"Cấp III",1.78,1.65,1.4,1.27,1.17,1.06,0.93,0.79,0.57999999999999996,0.47,0.42]
[null,null,null,null,null,null,null,null,null,null,null,null,null,null,null,null,null,5,"Cấp IV",1.59,1.47,1.24,1.1399999999999999,0.98,0.83]
[]
[null,null,null,null,null,null,null,null,null,null,null,null,null,null,null,null,null,"Bảng số 2.7: Định mức chi phí thiết kế bản vẽ thi công của công trình công nghiệp có yêu cầu thiết kế 2 bước",null,null,null,null,null,null,null,null,null,null,null,null,null,null,"Bảng CN2"]
[null,null,null,null,null,null,null,null,null,null,null,null,null,null,null,null,null,null,null,null,null,null,null,null,null,null,null,null,null,null,null,"TT","Công trình",null,null,"Chi phí thiết bị (tỷ đồng)"]
[null,null,null,null,null,null,null,null,null,null,null,null,null,null,null,null,null,"TT","Cấp công trình","Chi phí xây dựng (chưa có thuế GTGT) (tỷ đồng)",null,null,null,null,null,null,null,null,null,null,null,null,null,5,15,25,50,100,200,500,1000,3000]
[null,null,null,null,null,null,null,null,null,null,null,null,null,null,null,null,null,null,null,10,20,50,100,200,500,1000,2000,5000,8000,10000,null,1,"Công trình hoá chất",1.1000000000000001,1,0.9,0.85,0.8,0.7,0.6,0.55000000000000004,0.45]
[null,null,null,null,null,null,null,null,null,null,null,null,null,null,null,null,null,1,"Cấp đặc biệt",4.7,4.2699999999999996,3.66,3.32,3.01,2.75,2.4,2.0299999999999998,1.52,1.21,1.04,null,2,"Công trình khai thác than, quặng (mỏ vật liệu):"]
[null,null,null,null,null,null,null,null,null,null,null,null,null,null,null,null,null,2,"Cấp I",3.87,3.57,3.02,2.77,2.5,2.2799999999999998,2.0099999999999998,1.7,1.26,1.02,0.88,null,null,"- Mỏ lộ thiên",0.95,0.85,0.8,0.75,0.7,0.6,0.55000000000000004,0.5,0.4]
[null,null,null,null,null,null,null,null,null,null,null,null,null,null,null,null,null,3,"Cấp II",3.13,2.9,2.4300000000000002,2.2400000000000002,2.0299999999999998,1.9,1.66,1.42,1.04,0.82,0.72,null,null,"- Mỏ hầm lò",1.1499999999999999,1,0.95,0.9,0.8,0.75,0.65,0.6,0.5]
[null,null,null,null,null,null,null,null,null,null,null,null,null,null,null,null,null,4,"Cấp III",2.78,2.57,2.16,1.99,1.79,1.68,1.47,1.25,0.91,0.72,0.64,null,3,"Công trình sx xi măng",null,null,null,1.1499999999999999,1.1000000000000001,1.05,1.01,0.96,0.8]
[null,null,null,null,null,null,null,null,null,null,null,null,null,null,null,null,null,5,"Cấp IV",2.46,2.25,1.89,1.72,1.47,1.22,null,null,null,null,null,null,4,"Công trình trạm biến áp",0.73,0.65,0.56000000000000005,0.51,0.48,0.42,0.37,0.34,0.3]
[]
[null,null,null,null,null,null,null,null,null,null,null,null,null,null,null,null,null,"Bảng số 2.8: Định mức chi phí thiết kế kỹ thuật của công trình giao thông có yêu cầu thiết kế 3 bước"]
[]
[null,null,null,null,null,null,null,null,null,null,null,null,null,null,null,null,null,"TT","Cấp công trình","Chi phí xây dựng (chưa có thuế GTGT) (tỷ đồng)"]
[null,null,null,null,null,null,null,null,null,null,null,null,null,null,null,null,null,null,null,10,20,50,100,200,500,1000,2000,5000,8000,10000]
[null,null,null,null,null,null,null,null,null,null,null,null,null,null,null,null,null,1,"Cấp đặc biệt",2.0499999999999998,1.92,1.68,1.5,1.36,1.24,1.08,0.92,0.68,0.51,0.45]
[null,null,null,null,null,null,null,null,null,null,null,null,null,null,null,null,null,2,"Cấp I",1.44,1.39,1.1299999999999999,1.05,0.95,0.81,0.68,0.57999999999999996,0.44,0.34,0.28000000000000003]
[null,null,null,null,null,null,null,null,null,null,null,null,null,null,null,null,null,3,"Cấp II",1.19,1.08,0.92,0.84,0.77,0.7,0.6,0.51,0.39,0.28999999999999998,0.25]
[null,null,null,null,null,null,null,null,null,null,null,null,null,null,null,null,null,4,"Cấp III",1.05,0.93,0.81,0.74,0.68,0.57999999999999996,0.48,0.43,0.32,0.25,0.21000000000001301]
[null,null,null,null,null,null,null,null,null,null,null,null,null,null,null,null,null,5,"Cấp IV",0.95,0.87,0.76,0.69,0.59,0.49,0.43]
[]
[null,null,null,null,null,null,null,null,null,null,null,null,null,null,null,null,null,"Bảng số 2.9: Định mức chi phí thiết kế bản vẽ thi công của công trình giao thông có yêu cầu thiết kế 2 bước"]
[]
[null,null,null,null,null,null,null,null,null,null,null,null,null,null,null,null,null,"TT","Cấp công trình","Chi phí xây dựng (chưa có thuế GTGT) (tỷ đồng)"]
[null,null,null,null,null,null,null,null,null,null,null,null,null,null,null,null,null,null,null,10,20,50,100,200,500,1000,2000,5000,8000,10000]
[null,null,null,null,null,null,null,null,null,null,null,null,null,null,null,null,null,1,"Cấp đặc biệt",3.01,2.76,2.36,2.15,1.95,1.78,1.52,1.32,1.02,0.75,0.66]
[null,null,null,null,null,null,null,null,null,null,null,null,null,null,null,null,null,2,"Cấp I",2.27,2.15,1.83,1.67,1.51,1.38,1.21,1.03,0.79,0.61,0.49]
[null,null,null,null,null,null,null,null,null,null,null,null,null,null,null,null,null,3,"Cấp II",1.67,1.55,1.32,1.2,1.1000000000000001,1.01,0.85,0.72,0.56000000000000005,0.42,0.36]
[null,null,null,null,null,null,null,null,null,null,null,null,null,null,null,null,null,4,"Cấp III",1.48,1.37,1.17,1.06,0.97,0.82,0.7,0.59,0.45,0.33,0.29000000000001303]
[null,null,null,null,null,null,null,null,null,null,null,null,null,null,null,null,null,5,"Cấp IV",1.37,1.26,1.08,0.98,0.83,0.71,0,0,0,0,0]
[]
[null,null,null,null,null,null,null,null,null,null,null,null,null,null,null,null,null,"Bảng số 2.10: Định mức chi phí thiết kế kỹ thuật của công trình nông nghiệp và phát triển nông thôn có yêu cầu thiết kế 3 bước"]
[null,null,null,null,null,null,null,null,null,null,null,null,null,null,null,null,null,null,null,null,null,null,null,null,null,null,null,null,null,null,null,null,"Bảng TL1"]
[null,null,null,null,null,null,null,null,null,null,null,null,null,null,null,null,null,"TT","Cấp công trình","Chi phí xây dựng (chưa có thuế GTGT) (tỷ đồng)",null,null,null,null,null,null,null,null,null,null,null,null,"Chi phí thiết bị (chưa có thuế GTGT) (tỷ đồng)","Cấp công trình"]
[null,null,null,null,null,null,null,null,null,null,null,null,null,null,null,null,null,null,null,10,20,50,100,200,500,1000,2000,5000,8000,10000,null,null,null,"Cấp đặc biệt và cấp I","cấp II, cấp III và cấp IV"]
[null,null,null,null,null,null,null,null,null,null,null,null,null,null,null,null,null,1,"Cấp đặc biệt",2.98,2.6,2.2000000000000002,1.98,1.83,1.54,1.3,1.1299999999999999,0.85,0.66,0.57999999999999996,null,null,500,0.75,0.62,null,"Cấp công trình",2,5,20,50,100,200,500]
[null,null,null,null,null,null,null,null,null,null,null,null,null,null,null,null,null,2,"Cấp I",2.7,2.36,1.99,1.78,1.66,1.39,1.17,1.02,0.77,0.59,0.52,null,null,200,0.89,0.74,null,"Cấp đặc biệt và cấp I",2.89,2.5299999999999998,1.46,1.42,1.07,0.89,0.75]
[null,null,null,null,null,null,null,null,null,null,null,null,null,null,null,null,null,3,"Cấp II",2.48,2.14,1.8,1.61,1.51,1.22,1.05,0.87,0.67,0.49,0.42,null,null,100,1.07,0.9,null,"cấp II, cấp III và cấp IV",2.58,2.2599999999999998,1.29,1.23,0.9,0.74,0.62]
[null,null,null,null,null,null,null,null,null,null,null,null,null,null,null,null,null,4,"Cấp III",2.2000000000000002,1.9,1.6,1.43,1.24,1.06,0.9,0.77,0.59,0.43,0.37,null,null,50,1.42,1.23]
[null,null,null,null,null,null,null,null,null,null,null,null,null,null,null,null,null,5,"Cấp IV",1.74,1.52,1.27,1.1200000000000001,1.01,0.8,0.64,null,null,null,null,null,null,20,1.46,1.29]
[null,null,null,null,null,null,null,null,null,null,null,null,null,null,null,null,null,null,null,null,null,null,null,null,null,null,null,null,null,null,null,null,5,2.5299999999999998,2.2599999999999998]
[null,null,null,null,null,null,null,null,null,null,null,null,null,null,null,null,null,"Bảng số 2.11: Định mức chi phí thiết kế bản vẽ thi công của công trình nông nghiệp và phát triển nông thôn có yêu cầu thiết kế 2 bước",null,null,null,null,null,null,null,null,null,null,null,null,null,null,"<2",2.89,2.58]
[]
[null,null,null,null,null,null,null,null,null,null,null,null,null,null,null,null,null,"TT","Cấp công trình","Chi phí xây dựng (chưa có thuế GTGT) (tỷ đồng)"]
[null,null,null,null,null,null,null,null,null,null,null,null,null,null,null,null,null,null,null,10,20,50,100,200,500,1000,2000,5000,8000,10000]
[null,null,null,null,null,null,null,null,null,null,null,null,null,null,null,null,null,1,"Cấp đặc biệt",4.29,3.75,3.17,2.85,2.6,2.21,1.87,1.58,1.22,0.95,0.83]
[null,null,null,null,null,null,null,null,null,null,null,null,null,null,null,null,null,2,"Cấp I",3.89,3.4,2.87,2.57,2.36,2,1.69,1.43,1.1000000000000001,0.85,0.74]
[null,null,null,null,null,null,null,null,null,null,null,null,null,null,null,null,null,3,"Cấp II",3.53,3.11,2.62,2.34,2.15,1.73,1.48,1.25,0.96,0.69,0.57999999999999996]
[null,null,null,null,null,null,null,null,null,null,null,null,null,null,null,null,null,4,"Cấp III",3.13,2.76,2.31,2.0699999999999998,1.79,1.52,1.29,1.1000000000000001,0.83,0.6,0.51]
[null,null,null,null,null,null,null,null,null,null,null,null,null,null,null,null,null,5,"Cấp IV",2.48,2.19,1.82,1.61,1.41,1.1399999999999999]
[]
[null,null,null,null,null,null,null,null,null,null,null,null,null,null,null,null,null,"Bảng số 2.12: Định mức chi phí thiết kế kỹ thuật của công trình hạ tầng kỹ thuật có yêu cầu thiết kế 3 bước"]
[]
[null,null,null,null,null,null,null,null,null,null,null,null,null,null,null,null,null,"TT","Cấp công trình","Chi phí xây dựng (chưa có thuế GTGT) (tỷ đồng)"]
[null,null,null,null,null,null,null,null,null,null,null,null,null,null,null,null,null,null,null,10,20,50,100,200,500,1000,2000,5000,8000,10000]
[null,null,null,null,null,null,null,null,null,null,null,null,null,null,null,null,null,1,"Cấp đặc biệt",2.2200000000000002,1.94,1.63,1.48,1.36,1.1399999999999999,0.97,0.83,0.61,0.48,0.43]
[null,null,null,null,null,null,null,null,null,null,null,null,null,null,null,null,null,2,"Cấp I",2.09,1.83,1.53,1.38,1.28,1.04,0.9,0.75,0.53,0.39,0.33]
[null,null,null,null,null,null,null,null,null,null,null,null,null,null,null,null,null,3,"Cấp II",1.86,1.62,1.36,1.22,1.1299999999999999,0.91,0.78,0.66,0.47,0.34,0.28999999999999998]
[null,null,null,null,null,null,null,null,null,null,null,null,null,null,null,null,null,4,"Cấp III",1.62,1.39,1.19,1.07,0.97,0.8,0.7,0.56000000000000005,0.41,0.28999999999999998,0.25000000000001299]
[null,null,null,null,null,null,null,null,null,null,null,null,null,null,null,null,null,5,"Cấp IV",1.45,1.23,1.01,0.92,0.8,0.7,0.57999999999999996]
[]
[null,null,null,null,null,null,null,null,null,null,null,null,null,null,null,null,null,"Bảng số 2.13: Định mức chi phí thiết kế bản vẽ thi công của công trình hạ tầng kỹ thuật có yêu cầu thiết kế 2 bước",null,null,null,null,null,null,null,null,null,null,null,null,null,null,"Bảng HTKT1:"]
[]
[null,null,null,null,null,null,null,null,null,null,null,null,null,null,null,null,null,"TT","Cấp công trình","Chi phí xây dựng (chưa có thuế GTGT) (tỷ đồng)",null,null,null,null,null,null,null,null,null,null,null,null,"Công trình","Chi phí xây dựng và thiết bị (chưa có thuế GTGT) (tỷ đồng)"]
[null,null,null,null,null,null,null,null,null,null,null,null,null,null,null,null,null,null,null,10,20,50,100,200,500,1000,2000,5000,8000,10000,null,null,null,5,10,15,25,50,100,200,500]
[null,null,null,null,null,null,null,null,null,null,null,null,null,null,null,null,null,1,"Cấp đặc biệt",3.23,2.79,2.35,2.13,1.95,1.64,1.39,1.19,0.9,0.7,0.63,null,null,"Công trinh cáp chôn trực tiếp",1.83,1.4,1.3,1.1000000000000001,0.95,0.8,0.7,0.6]
[null,null,null,null,null,null,null,null,null,null,null,null,null,null,null,null,null,2,"Cấp I",3.01,2.63,2.21,1.99,1.82,1.49,1.28,1.07,0.79,0.57999999999999996,0.49,null,null,"Công trình tuyến cáp chôn qua sông",1.9,1.5,1.4,1.3,1.1000000000000001,1,0.9,0.7]
[null,null,null,null,null,null,null,null,null,null,null,null,null,null,null,null,null,3,"Cấp II",2.68,2.33,1.97,1.77,1.58,1.32,1.1399999999999999,0.92,0.7,0.51,0.43,null,null,"Công trình hào kỹ thuật, cống cáp",2.1,1.6,1.5,1.35,1.1499999999999999,1.05,0.95,0.8]
[null,null,null,null,null,null,null,null,null,null,null,null,null,null,null,null,null,4,"Cấp III",2.36,2.0099999999999998,1.72,1.55,1.39,1.1599999999999999,1.02,0.81,0.61,0.44,0.36]
[null,null,null,null,null,null,null,null,null,null,null,null,null,null,null,null,null,5,"Cấp IV",2.0699999999999998,1.76,1.49,1.35,1.1499999999999999,0.98]
[null,null,null,null,null,null,null,null,null,null,null,null,null,null,null,null,null,null,null,null,null,null,null,null,null,null,null,null,null,null,null,null,"Bảng HTKT2:"]
[null,null,null,null,null,null,null,null,null,null,null,null,null,null,null,null,null,"Bảng số 2.14: Định mức chi phí thẩm tra báo cáo nghiên cứu tiền khả thi",null,null,null,null,null,null,null,null,null,null,null,null,null,null,"Cống trình","Chi phí xây dựng và thiết bị (chưa có thuế GTGT) (tỷ đồng)"]
[null,null,null,null,null,null,null,null,null,null,null,null,null,null,null,null,null,null,null,null,null,null,null,null,null,null,null,null,null,null,null,null,null,5,10,15,25,50,100,200,500]
[null,null,null,null,null,null,null,null,null,null,null,null,null,null,null,null,null,"TT","Loại công trình","Chi phí xây dựng và thiết bị (chưa có thuế GTGT) (tỷ đồng)",null,null,null,null,null,null,null,null,null,null,null,null,"Các loại tổng đài host, vệ tinh, độc lập",1,0.75,0.6,0.5,0.45,0.35,0.25,0.15]
[null,null,null,null,null,null,null,null,null,null,null,null,null,null,null,null,null,null,null,15,20,50,100,200,500,1000,2000,5000,10000,20000,30000,null,"Các loại tổng đài MSC, BSC, truy nhập thuê bao, nhắn tin",0.9,0.7,0.55000000000000004,0.45,0.4,0.3,0.2,0.1]
[null,null,null,null,null,null,null,null,null,null,null,null,null,null,null,null,null,1,"Công trình dân dụng",7.0999999999999994E-2,5.8999999999999997E-2,4.8000000000000001E-2,3.4000000000000002E-2,2.5000000000000001E-2,1.6E-2,1.4E-2,1.2E-2,8.9999999999999993E-3,7.0000000000000001E-3,5.0000000000000001E-3,4.0000000000013003E-3,null,"Hệ thống thiết bị truyền dẫn quang",1.35,0.8,0.6,0.5,0.4,0.3,0.2,0.1]
[null,null,null,null,null,null,null,null,null,null,null,null,null,null,null,null,null,2,"Công trình công nghiệp",9.8000000000000004E-2,8.3000000000000004E-2,6.7000000000000004E-2,4.9000000000000002E-2,3.6999999999999998E-2,2.8000000000000001E-2,2.5000000000000001E-2,0.02,1.4999999999999999E-2,0.01,7.0000000000000001E-3,5.0000000000000001E-3,null,"Hệ thống truyền dẫn vi ba",1.7,1.4,1.3,0.8,0.6,0.45,0.3,0.15]
[null,null,null,null,null,null,null,null,null,null,null,null,null,null,null,null,null,3,"Công trình giao thông",5.3999999999999999E-2,4.9000000000000002E-2,3.9E-2,0.03,0.02,1.2999999999999999E-2,1.0999999999999999E-2,8.9999999999999993E-3,7.0000000000000001E-3,5.0000000000000001E-3,4.0000000000000001E-3,3.0000000000000001E-3,null,"Mạng viễn thông nông thôn",2.8,1.75,1.4,0.9,0.65,0.5,0.35,0.2]
[null,null,null,null,null,null,null,null,null,null,null,null,null,null,null,null,null,4,"Công trình nông nghiệp và phát triển nông thôn",6.4000000000000001E-2,5.8000000000000003E-2,4.7E-2,3.3000000000000002E-2,2.4E-2,1.4999999999999999E-2,1.2999999999999999E-2,1.0999999999999999E-2,8.9999999999999993E-3,6.0000000000000001E-3,5.0000000000000001E-3,4.0000000000000001E-3,null,"Mạng Internet, Voip, thiết bị mạng NGN",1,0.75,0.6,0.5,0.4,0.3,0.2,0.1]
[null,null,null,null,null,null,null,null,null,null,null,null,null,null,null,null,null,5,"Công trình hạ tầng",5.6000000000000001E-2,5.0999999999999997E-2,4.1000000000000002E-2,3.2000000000000001E-2,2.1000000000000001E-2,1.2999999999999999E-2,1.2E-2,0.01,8.0000000000000002E-3,5.0000000000000001E-3,4.0000000000000001E-3,3.0000000000000001E-3,null,"Hệ thống tiếp đất chống sét (cả thiết bị)",2.15,1.05,0.85,0.65,0.55000000000000004,0.35,0.25,0.2]
[null,null,null,null,null,null,null,null,null,null,null,null,null,null,null,null,null,null,null,null,null,null,null,null,null,null,null,null,null,null,null,null,"Trạm thông tin vệ tinh Vsat",1.8,1.3,1.1000000000000001,0.9,0.7,0.5,0.35,0.2]
[null,null,null,null,null,null,null,null,null,null,null,null,null,null,null,null,null,null,null,null,null,null,null,null,null,null,null,null,null,null,null,null,"Trạm BTS, CS, điện thoại thè",1.25,0.7,0.5,0.35,0.3,0.25,0.2,0.1]
[null,null,null,null,null,null,null,null,null,null,null,null,null,null,null,null,null,"Bảng số 2.15: Định mức chi phí thẩm tra báo cáo nghiên cứu khả thi"]
[]
[null,null,null,null,null,null,null,null,null,null,null,null,null,null,null,null,null,"TT","Loại công trình","Chi phí xây dựng và thiết bị (chưa có thuế GTGT) (tỷ đồng)"]
[null,null,null,null,null,null,null,null,null,null,null,null,null,null,null,null,null,null,null,15,20,50,100,200,500,1000,2000,5000,10000,20000,30000]
[null,null,null,null,null,null,null,null,null,null,null,null,null,null,null,null,null,1,"Công trình dân dụng",0.20399999999999999,0.16800000000000001,0.13800000000000001,9.7000000000000003E-2,7.0000000000000007E-2,4.5999999999999999E-2,4.1000000000000002E-2,3.4000000000000002E-2,2.5999999999999999E-2,1.9E-2,1.4999999999999999E-2,1.20000000000013E-2]
[null,null,null,null,null,null,null,null,null,null,null,null,null,null,null,null,null,2,"Công trình công nghiệp",0.28100000000000003,0.23799999999999999,0.19,0.14099999999999999,0.107,0.08,7.0000000000000007E-2,5.6000000000000001E-2,4.3999999999999997E-2,2.9000000000000001E-2,0.02,1.4999999999999999E-2]
[null,null,null,null,null,null,null,null,null,null,null,null,null,null,null,null,null,3,"Công trình giao thông",0.153,0.13900000000000001,0.112,8.6999999999999994E-2,5.8000000000000003E-2,3.5999999999999997E-2,3.2000000000000001E-2,2.5999999999999999E-2,0.02,1.4E-2,0.01,8.9999999999999993E-3]
[null,null,null,null,null,null,null,null,null,null,null,null,null,null,null,null,null,4,"Công trình nông nghiệp và phát triển nông thôn",0.182,0.16700000000000001,0.13300000000000001,9.4E-2,6.8000000000000005E-2,4.3999999999999997E-2,3.6999999999999998E-2,3.2000000000000001E-2,2.5999999999999999E-2,1.7000000000000001E-2,1.4E-2,0.01]
[null,null,null,null,null,null,null,null,null,null,null,null,null,null,null,null,null,5,"Công trình hạ tầng",0.16,0.14499999999999999,0.11600000000000001,9.1999999999999998E-2,0.06,3.6999999999999998E-2,3.4000000000000002E-2,2.9000000000000001E-2,2.1999999999999999E-2,1.4999999999999999E-2,0.01,8.9999999999999993E-3]
[]
[null,null,null,null,null,null,null,null,null,null,null,null,null,null,null,null,null,"Bảng số 2.16: Định mức chi phí thẩm tra thiết kế xây dựng"]
[]
[null,null,null,null,null,null,null,null,null,null,null,null,null,null,null,null,null,"TT","Loại công trình","Chi phí xây dựng (chưa có thuế GTGT) trong tổng mức đầu tư hoặc trong dự toán gói thầu (tỷ đồng)"]
[null,null,null,null,null,null,null,null,null,null,null,null,null,null,null,null,null,null,null,10,20,50,100,200,500,1000,2000,5000,8000,10000]
[null,null,null,null,null,null,null,null,null,null,null,null,null,null,null,null,null,1,"Công trình dân dụng",0.25800000000000001,0.223,0.17199999999999999,0.14299999999999999,0.108,8.3000000000000004E-2,6.8000000000000005E-2,4.3999999999999997E-2,3.3000000000000002E-2,2.8000000000000001E-2,2.5999999999999999E-2]
[null,null,null,null,null,null,null,null,null,null,null,null,null,null,null,null,null,2,"Công trình công nghiệp",0.28999999999999998,0.252,0.192,0.14599999999999999,0.113,8.6999999999999994E-2,6.6000000000000003E-2,5.2999999999999999E-2,3.7999999999999999E-2,3.1E-2,2.8000000000000001E-2]
[null,null,null,null,null,null,null,null,null,null,null,null,null,null,null,null,null,3,"Công trình giao thông",0.17,0.14699999999999999,0.113,8.4000000000000005E-2,7.2999999999999995E-2,5.5E-2,4.2000000000000003E-2,3.5000000000000003E-2,2.4E-2,0.02,1.7000000000000001E-2]
[null,null,null,null,null,null,null,null,null,null,null,null,null,null,null,null,null,4,"Công trình nông nghiệp và phát triển nông thôn",0.189,0.16300000000000001,0.125,9.2999999999999999E-2,7.2999999999999995E-2,5.6000000000000001E-2,4.2999999999999997E-2,3.5000000000000003E-2,2.5999999999999999E-2,2.1999999999999999E-2,1.9E-2]
[null,null,null,null,null,null,null,null,null,null,null,null,null,null,null,null,null,5,"Công trình hạ tầng kỹ",0.19700000000000001,0.17199999999999999,0.13300000000000001,9.9000000000000005E-2,7.5999999999999998E-2,5.8999999999999997E-2,4.5999999999999999E-2,0.04,2.9000000000000001E-2,2.4E-2,2.1000000000000001E-2,null,"Tối thiểu 2 triệu"]
[]
[null,null,null,null,null,null,null,null,null,null,null,null,null,null,null,null,null,"Bảng số 2.17: Định mức chi phí thẩm tra dự toán xây dựng"]
[]
[null,null,null,null,null,null,null,null,null,null,null,null,null,null,null,null,null,"TT","Loại công trình","Chi phí xây dựng (chưa có thuế GTGT) trong tổng mức đầu tư hoặc trong dự toán gói thầu (tỷ đồng)"]
[null,null,null,null,null,null,null,null,null,null,null,null,null,null,null,null,null,null,null,10,20,50,100,200,500,1000,2000,5000,8000,10000]
[null,null,null,null,null,null,null,null,null,null,null,null,null,null,null,null,null,1,"Công trình dân dụng",0.25,0.219,0.16600000000000001,0.14000000000000001,0.105,7.6999999999999999E-2,6.4000000000000001E-2,4.2999999999999997E-2,3.2000000000000001E-2,2.7E-2,2.5000000000000001E-2]
[null,null,null,null,null,null,null,null,null,null,null,null,null,null,null,null,null,2,"Công trình công nghiệp",0.28199999999999997,0.24399999999999999,0.185,0.14099999999999999,0.108,8.3000000000000004E-2,6.2E-2,0.05,3.4000000000000002E-2,0.03,2.7E-2]
[null,null,null,null,null,null,null,null,null,null,null,null,null,null,null,null,null,3,"Công trình giao thông",0.16600000000000001,0.14199999999999999,0.106,8.2000000000000003E-2,6.9000000000000006E-2,5.1999999999999998E-2,4.1000000000000002E-2,3.4000000000000002E-2,2.1000000000000001E-2,1.7999999999999999E-2,1.6E-2]
[null,null,null,null,null,null,null,null,null,null,null,null,null,null,null,null,null,4,"Công trình nông nghiệp và phát triển nông thôn",0.183,0.158,0.11899999999999999,9.1999999999999998E-2,7.0000000000000007E-2,5.2999999999999999E-2,0.04,3.4000000000000002E-2,2.4E-2,2.1000000000000001E-2,1.7999999999999999E-2]
[null,null,null,null,null,null,null,null,null,null,null,null,null,null,null,null,null,5,"Công trình hạ tầng kỹ thuật",0.191,0.16600000000000001,0.128,9.5000000000000001E-2,7.1999999999999995E-2,5.6000000000000001E-2,4.3999999999999997E-2,3.6999999999999998E-2,2.5999999999999999E-2,2.1999999999999999E-2,0.02,null,"Tối thiểu 2 triệu"]
[]
[null,null,null,null,null,null,null,null,null,null,null,null,null,null,null,null,null,"Bảng số 2.18: Định mức chi phí lập hồ sơ mời thầu, đánh giá hồ sơ dự thầu tư vấn"]
[]
[null,null,null,null,null,null,null,null,null,null,null,null,null,null,null,null,null,null,"Chi phí tư vấn (chưa có thuế GTGT) trong dự toán gói thầu tư vấn (tỷ đồng)",1,3,5,10,20,50,100,null,null,"Lập 45%"]
[null,null,null,null,null,null,null,null,null,null,null,null,null,null,null,null,null,null,"Tỷ lệ %",0.81599999999999995,0.58299999999999996,0.505,0.38900000000000001,0.311,0.17599999999999999,0.114,null,null,"Đánh giá 55%"]
[]
[null,null,null,null,null,null,null,null,null,null,null,null,null,null,null,null,null,"Bảng số 2.19: Định mức chi phí lập hồ sơ mời thầu, đánh giá hồ sơ dự thầu thi công xây dựng"]
[]
[null,null,null,null,null,null,null,null,null,null,null,null,null,null,null,null,null,"TT","Loại công trình","Chi phí xây dựng (chưa có thuế GTGT) trong dự toán gói thầu thi công xây dựng (tỷ đồng)"]
[null,null,null,null,null,null,null,null,null,null,null,null,null,null,null,null,null,null,null,10,20,50,100,200,500,1000,2000]
[null,null,null,null,null,null,null,null,null,null,null,null,null,null,null,null,null,1,"Công trình dân dụng",0.432,0.34599999999999997,0.19500000000000001,0.127,7.8E-2,5.7000000000000002E-2,0.04,3.2000000000000001E-2]
[null,null,null,null,null,null,null,null,null,null,null,null,null,null,null,null,null,2,"Công trình công nghiệp",0.54900000000000004,0.379,0.21099999999999999,0.14399999999999999,9.6000000000000002E-2,6.7000000000000004E-2,5.1999999999999998E-2,4.1000000000000002E-2]
[null,null,null,null,null,null,null,null,null,null,null,null,null,null,null,null,null,3,"Công trình giao thông",0.34599999999999997,0.23699999999999999,0.151,0.09,5.7000000000000002E-2,4.2999999999999997E-2,2.9000000000000001E-2,2.3E-2]
[null,null,null,null,null,null,null,null,null,null,null,null,null,null,null,null,null,4,"Công trình nông nghiệp và phát triển nông thôn",0.36099999999999999,0.30199999999999999,0.16600000000000001,9.4E-2,6.6000000000000003E-2,4.5999999999999999E-2,3.1E-2,2.5999999999999999E-2]
[null,null,null,null,null,null,null,null,null,null,null,null,null,null,null,null,null,5,"Công trình hạ tầng kỹ thuật",0.38800000000000001,0.32500000000000001,0.17199999999999999,0.106,6.9000000000000006E-2,5.1999999999999998E-2,3.7999999999999999E-2,2.8000000000000001E-2]
[]
[null,null,null,null,null,null,null,null,null,null,null,null,null,null,null,null,null,"Bảng số 2.20: Định mức chi phí lập hồ sơ mời thầu, đánh giá hồ sơ dự thầu mua sắm vật tư, thiết bị"]
[]
[null,null,null,null,null,null,null,null,null,null,null,null,null,null,null,null,null,"TT","Loại công trình","Chi phí vật tư, thiết bị (chưa có thuế GTGT) trong dự toán gói thầu mua sắm vật tư, thiết bị (tỷ đồng)"]
[null,null,null,null,null,null,null,null,null,null,null,null,null,null,null,null,null,null,null,10,20,50,100,200,500,1000,2000]
[null,null,null,null,null,null,null,null,null,null,null,null,null,null,null,null,null,1,"Công trình dân dụng",0.36699999999999999,0.34599999999999997,0.18099999999999999,0.113,0.10199999999999999,8.1000000000000003E-2,5.5E-2,4.2999999999999997E-2]
[null,null,null,null,null,null,null,null,null,null,null,null,null,null,null,null,null,2,"Công trình công nghiệp",0.54900000000000004,0.49399999999999999,0.28000000000000003,0.17699999999999999,0.152,0.123,8.4000000000000005E-2,6.6000000000000003E-2]
[null,null,null,null,null,null,null,null,null,null,null,null,null,null,null,null,null,3,"Công trình giao thông",0.26100000000000001,0.23,0.13100000000000001,8.4000000000000005E-2,7.3999999999999996E-2,5.6000000000000001E-2,0.04,3.2000000000000001E-2]
[null,null,null,null,null,null,null,null,null,null,null,null,null,null,null,null,null,4,"Công trình nông nghiệp và phát triển nông thôn",0.28100000000000003,0.245,0.14000000000000001,0.09,7.8E-2,6.0999999999999999E-2,0.05,3.6999999999999998E-2]
[null,null,null,null,null,null,null,null,null,null,null,null,null,null,null,null,null,5,"Công trình hạ tầng kỹ thuật",0.30199999999999999,0.26,0.156,0.10199999999999999,8.6999999999999994E-2,6.9000000000000006E-2,5.3999999999999999E-2,4.1000000000000002E-2]
[]
[null,null,null,null,null,null,null,null,null,null,null,null,null,null,null,null,null,"Bảng số 2.21: Định mức chi phí giám sát thi công xây dựng"]
[]
[null,null,null,null,null,null,null,null,null,null,null,null,null,null,null,null,null,"TT","Loại công trình","Chi phí xây dựng (chưa có thuế GTGT) trong dự toán gói thầu thi công xây dựng (tỷ đồng)"]
[null,null,null,null,null,null,null,null,null,null,null,null,null,null,null,null,null,null,null,10,20,50,100,200,500,1000,2000,5000,8000,10000]
[null,null,null,null,null,null,null,null,null,null,null,null,null,null,null,null,null,1,"Công trình đân dụng",3.2850000000000001,2.8530000000000002,2.4350000000000001,1.845,1.546,1.1879999999999999,0.79700000000000004,0.69399999999999995,0.62,0.53,0.47799999999999998]
[null,null,null,null,null,null,null,null,null,null,null,null,null,null,null,null,null,2,"Công trình công nghiệp",3.508,3.137,2.5590000000000002,2.0739999999999998,1.6040000000000001,1.3009999999999999,0.82299999999999995,0.71599999999999997,0.64,0.55000000000000004,0.49299999999999999]
[null,null,null,null,null,null,null,null,null,null,null,null,null,null,null,null,null,3,"Công trình giao thông",3.2029999999999998,2.7,2.3559999999999999,1.714,1.272,1.0029999999999999,0.73099999999999998,0.63600000000000001,0.55000000000000004,0.48,0.438]
[null,null,null,null,null,null,null,null,null,null,null,null,null,null,null,null,null,4,"Công trình nông nghiệp và phát triển nông thôn",2.5979999999999999,2.2919999999999998,2.0750000000000002,1.5449999999999999,1.1890000000000001,0.95,0.63100000000000001,0.55000000000000004,0.49,0.42,0.378]
[null,null,null,null,null,null,null,null,null,null,null,null,null,null,null,null,null,5,"Công trình hạ tầng kỹ thuật",2.5659999999999998,2.2559999999999998,1.984,1.4610000000000001,1.1419999999999999,0.91200000000000003,0.58399999999999996,0.50900000000000001,0.45200000000000001,0.39,0.35]
[]
[null,null,null,null,null,null,null,null,null,null,null,null,null,null,null,null,null,"Bảng sô 23: Định mức chi phí giám sát lăp đặt thiêt bị"]
[]
[null,null,null,null,null,null,null,null,null,null,null,null,null,null,null,null,null,"TT","Loai công trình","Chi phí xây dựng (chưa có thuế GTGT) trong dự toán gói thầu thiết bị (tỷ đồng)"]
[null,null,null,null,null,null,null,null,null,null,null,null,null,null,null,null,null,null,null,10,20,50,100,200,500,1000,2000,5000,8000,10000]
[null,null,null,null,null,null,null,null,null,null,null,null,null,null,null,null,null,1,"Công trình dân dụng",0.84399999999999997,0.71499999999999997,0.59599999999999997,0.39400000000000002,0.30499999999999999,0.26100000000000001,0.17599999999999999,0.153,0.13200000000000001,0.112,0.110000000000013]
[null,null,null,null,null,null,null,null,null,null,null,null,null,null,null,null,null,2,"Công trình công nghiệp",1.147,1.0049999999999999,0.95799999999999996,0.81100000000000005,0.49,0.42199999999999999,0.35599999999999998,0.309,0.27,0.23,0.21]
[null,null,null,null,null,null,null,null,null,null,null,null,null,null,null,null,null,3,"Công trình giao thông",0.67700000000000005,0.57999999999999996,0.48599999999999999,0.32,0.26100000000000001,0.217,0.14599999999999999,0.127,0.11,9.1999999999999998E-2,8.5000000000000006E-2]
[null,null,null,null,null,null,null,null,null,null,null,null,null,null,null,null,null,4,"Công trình nông nghiệp và phát triển nông thôn",0.71799999999999997,0.58499999999999996,0.52,0.34399999999999997,0.27600000000000002,0.23200000000000001,0.159,0.13800000000000001,0.12,9.8000000000000004E-2,9.0999999999999998E-2]
[null,null,null,null,null,null,null,null,null,null,null,null,null,null,null,null,null,5,"Công trình hạ tầng kỹ thuật",0.80300000000000005,0.69,0.57499999999999996,0.38300000000000001,0.30000000000013,0.26100000000000001,0.17299999999999999,0.15,0.126,0.105,9.5000000000000001E-2]
[]
[null,null,null,null,null,null,null,null,null,null,null,null,null,null,null,null,null,"Bảng số 2.23: Định mức chi phí giám sát công tác khảo sát xây dựng"]
[]
[null,null,null,null,null,null,null,null,null,null,null,null,null,null,null,null,null,null,"Chi phí khảo sát xây dựng (chưa có thuế GTGT) của giá gói thầu khảo sát xây dựng được duyệt (tỷ đồng)",1,5,10,20,50]
[null,null,null,null,null,null,null,null,null,null,null,null,null,null,null,null,null,null,"Tỷ lệ %",4.0720000000000001,3.5409999999999999,3.0790000000000002,2.7069999999999999,2.3809999999999998]
[]
[null,null,null,null,null,null,null,null,null,null,null,null,null,null,null,null,null,"Bảng số 2.24: Định mức chi phí quy đổi vốn đầu tư xây dựng"]
[]
[null,null,null,null,null,null,null,null,null,null,null,null,null,null,null,null,null,null,"Giá trị tổng mức đầu tư (chưa có thuế GTGT) được duyệt (tỷ đồng)",100,300,500,1000,2000,5000,10000]
[null,null,null,null,null,null,null,null,null,null,null,null,null,null,null,null,null,null,"Tỷ lệ %",0.109,6.5000000000000002E-2,5.2999999999999999E-2,3.6999999999999998E-2,3.4000000000000002E-2,2.5000000000000001E-2,0.02]
[]
[]
[]
[null,null,null,null,null,null,null,null,null,null,null,null,null,null,null,null,null,null,"Chi phí kiểm toán độc lập và chi phí thẩm tra, phê duyệt quyết toán báo cáo quyết toán dự án hoàn thành (Điều 46 Nghị định 99/2021/NĐ-CP)"]
[null,null,null,null,null,null,null,null,null,null,null,null,null,null,null,null,null,null,"Loại chi phí","Tổng mức đầu tư của dự án sau loại trừ (tỷ đồng)"]
[null,null,null,null,null,null,null,null,null,null,null,null,null,null,null,null,null,null,null,5,10,50,100,500,1000,10000]
[null,null,null,null,null,null,null,null,null,null,null,null,null,null,null,null,null,null,"Thẩm tra, phê duyệt quyết toán (%)",0.56999999999999995,0.39,0.28499999999999998,0.22500000000000001,0.13500000000000001,0.09,4.8000000000000001E-2]
[null,null,null,null,null,null,null,null,null,null,null,null,null,null,null,null,null,null,"Kiểm toán độc lập (%)",0.96,0.64500000000000002,0.45,0.34499999999999997,0.19500000000000001,0.129,6.9000000000000006E-2]
[]
[]
[null,null,null,null,null,null,null,null,null,null,null,null,null,null,null,null,null,null,"BIỂU MỨC THU PHÍ THẨM ĐỊNH DỰ ÁN ĐẦU TƯ XÂY DỰNG"]
[null,null,null,null,null,null,null,null,null,null,null,null,null,null,null,null,null,null,"(theo Thông tư số 209/2016/TT-BTC ngày 10/11/2016 của Bộ Tài chính)"]
[null,null,null,null,null,null,null,null,null,null,null,null,null,null,null,null,null,null,"Tổng mức đầu tư DA (tỷ đ)",15,25,50,100,200,500,1000,2000,5000,10000,null,"tối đa không quá 150.000.000"]
[null,null,null,null,null,null,null,null,null,null,null,null,null,null,null,null,null,null,"Tỷ lệ %",1.9E-2,1.7000000000000001E-2,1.4999999999999999E-2,1.2500000000000001E-2,0.01,7.4999999999999997E-3,4.7000000000000002E-3,2.5000000000000001E-3,2E-3,1E-3]
[]
[null,null,null,null,null,null,null,null,null,null,null,null,null,null,null,null,null,"Thông tư số 210/2016/TT-BTC ngày 10/11/2016 của Bộ trưởng Bộ Tài chính"]
[null,null,null,null,null,null,null,null,null,null,null,null,null,null,null,null,null,"Phụ lục số 1: Phí thẩm định thiết kế kỹ thuật, phí thẩm định dự toán xây dựng (Thẩm định thiết kế kỹ thuật, thẩm định dự toán xây dựng đối với trường hợp thiết kế ba bước; thiết kế bản vẽ thi công, thẩm định dự toán công trình đối với trường hợp thiết kế hai bước)"]
[null,null,null,null,null,null,null,null,null,null,null,null,null,null,null,null,null,"1. Phí thẩm định thiết kế kỹ thuật"]
[]
[null,null,null,null,null,null,null,null,null,null,null,null,null,null,null,null,null,"Số TT","Loại công trình","Chi phí xây dựng (chưa có thuế GTGT) trong dự toán công trình hoặc dự toán gói thầu được duyệt (tỷ đồng)"]
[null,null,null,null,null,null,null,null,null,null,null,null,null,null,null,null,null,null,null,15,50,100,200,500,1000,2000,5000,8000]
[null,null,null,null,null,null,null,null,null,null,null,null,null,null,null,null,null,1,"Công trình dân dụng",0.16500000000000001,0.11,8.5000000000000006E-2,6.5000000000000002E-2,0.05,4.1000000000000002E-2,2.9000000000000001E-2,2.1999999999999999E-2,1.9E-2]
[null,null,null,null,null,null,null,null,null,null,null,null,null,null,null,null,null,2,"Công trình công nghiệp",0.19,0.126,9.7000000000000003E-2,7.4999999999999997E-2,5.8000000000000003E-2,4.3999999999999997E-2,3.5000000000000003E-2,2.5999999999999999E-2,2.1999999999999999E-2]
[null,null,null,null,null,null,null,null,null,null,null,null,null,null,null,null,null,3,"Công trình giao thông",0.109,7.1999999999999995E-2,5.5E-2,4.2999999999999997E-2,3.3000000000000002E-2,2.5000000000000001E-2,2.1000000000000001E-2,1.6E-2,1.4E-2]
[null,null,null,null,null,null,null,null,null,null,null,null,null,null,null,null,null,4,"Công trình nông nghiệp và phát triển nông thôn",0.121,0.08,6.0999999999999999E-2,4.8000000000000001E-2,3.6999999999999998E-2,2.8000000000000001E-2,2.3E-2,1.7000000000000001E-2,1.4E-2]
[null,null,null,null,null,null,null,null,null,null,null,null,null,null,null,null,null,5,"Công trình hạ tầng kỹ thuật",0.126,8.5000000000000006E-2,6.5000000000000002E-2,0.05,3.9E-2,0.03,2.5999999999999999E-2,1.9E-2,1.7000000000000001E-2]
[]
[null,null,null,null,null,null,null,null,null,null,null,null,null,null,null,null,null,"2. Phí thẩm định dự toán xây dựng"]
[null,null,null,null,null,null,null,null,null,null,null,null,null,null,null,null,null,"Số TT","Loại công trình","Chi phí xây dựng (chưa có thuế GTGT) trong dự toán công trình hoặc dự toán gói thầu được duyệt (tỷ đồng)"]
[null,null,null,null,null,null,null,null,null,null,null,null,null,null,null,null,null,null,null,15,50,100,200,500,1000,2000,5000,8000]
[null,null,null,null,null,null,null,null,null,null,null,null,null,null,null,null,null,1,"Công trình dân dụng",0.16,0.106,8.3000000000000004E-2,6.2E-2,4.5999999999999999E-2,3.7999999999999999E-2,2.8000000000000001E-2,2.1000000000000001E-2,1.7999999999999999E-2]
[null,null,null,null,null,null,null,null,null,null,null,null,null,null,null,null,null,2,"Công trình công nghiệp",0.185,0.121,9.4E-2,7.1999999999999995E-2,5.5E-2,4.1000000000000002E-2,3.3000000000000002E-2,2.3E-2,0.02]
[null,null,null,null,null,null,null,null,null,null,null,null,null,null,null,null,null,3,"Công trình giao thông",0.106,6.8000000000000005E-2,5.3999999999999999E-2,4.1000000000000002E-2,3.1E-2,2.4E-2,0.02,1.4E-2,1.2E-2]
[null,null,null,null,null,null,null,null,null,null,null,null,null,null,null,null,null,4,"Công trình nông nghiệp và phát triển nông thôn",0.11700000000000001,7.5999999999999998E-2,0.06,4.5999999999999999E-2,3.5000000000000003E-2,2.5999999999999999E-2,2.1999999999999999E-2,1.6E-2,1.4E-2]
[null,null,null,null,null,null,null,null,null,null,null,null,null,null,null,null,null,5,"Công trình hạ tầng kỹ thuật",0.122,8.2000000000000003E-2,6.2E-2,4.7E-2,3.6999999999999998E-2,2.9000000000000001E-2,2.4E-2,1.7000000000000001E-2,1.4E-2]
[]
[null,null,null,null,null,null,null,null,null,null,null,null,null,null,null,null,null,"Phụ lục số 2: Phí thẩm định thiết kế kỹ thuật, phí thẩm định dự toán xây dựng khi cơ quan chuyên môn về xây dựng mời tổ chức tư vấn, cá nhân cùng thẩm định (Thẩm định thiết kế kỹ thuật, thẩm định dự toán xây dựng đối với trường hợp thiết kế ba bước; thiết kế bản vẽ thi công, dự toán công trình đối với trường hợp thiết kế hai bước)"]
[null,null,null,null,null,null,null,null,null,null,null,null,null,null,null,null,null,"1. Phí thẩm định thiết kế kỹ thuật"]
[]
[null,null,null,null,null,null,null,null,null,null,null,null,null,null,null,null,null,"Số TT","Loại công trình","Chi phí xây dựng (chưa có thuế GTGT) trong dự toán công trình hoặc dự toán gói thầu được duyệt (tỷ đồng)"]
[null,null,null,null,null,null,null,null,null,null,null,null,null,null,null,null,null,null,null,15,50,100,200,500,"1. 000","2. 000","5. 000","8. 000"]
[null,null,null,null,null,null,null,null,null,null,null,null,null,null,null,null,null,1,"Công trình dân dụng",4.9500000000000002E-2,3.3000000000000002E-2,2.5499999999999998E-2,1.95E-2,1.4999999999999999E-2,1.23E-2,8.6999999999999994E-3,6.6E-3,5.7000000000000002E-3]
[null,null,null,null,null,null,null,null,null,null,null,null,null,null,null,null,null,2,"Công trình công nghiệp",5.7000000000000002E-2,3.78E-2,2.9100000000000001E-2,2.2499999999999999E-2,1.7399999999999999E-2,1.32E-2,1.0500000000000001E-2,7.7999999999999996E-3,6.6E-3]
[null,null,null,null,null,null,null,null,null,null,null,null,null,null,null,null,null,3,"Công trình giao thông",3.27E-2,2.1600000000000001E-2,1.6500000000000001E-2,1.29E-2,9.9000000000000008E-3,7.4999999999999997E-3,6.3E-3,4.7999999999999996E-3,4.1999999999999997E-3]
[null,null,null,null,null,null,null,null,null,null,null,null,null,null,null,null,null,4,"Công trình nông nghiệp và phát triển nông thôn",3.6299999999999999E-2,2.4E-2,1.83E-2,1.44E-2,1.11E-2,8.3999999999999995E-3,6.8999999999999999E-3,5.1000000000000004E-3,4.1999999999999997E-3]
[null,null,null,null,null,null,null,null,null,null,null,null,null,null,null,null,null,5,"Công trình hạ tầng kỹ thuật",3.78E-2,2.5499999999999998E-2,1.95E-2,1.4999999999999999E-2,1.17E-2,8.9999999999999993E-3,7.8E-2,5.7000000000000002E-3,5.1000000000000004E-3]
[null,null,null,null,null,null,null,null,null,null,null,null,null,null,null,null,null,"2. Phí thẩm định dự toán xây dựng"]
[]
[null,null,null,null,null,null,null,null,null,null,null,null,null,null,null,null,null,"Số TT","Loại công trình","Chi phí xây dựng (chưa có thuế GTGT) trong dự toán công trình hoặc dự toán gói thầu được duyệt (tỷ đồng)"]
[null,null,null,null,null,null,null,null,null,null,null,null,null,null,null,null,null,null,null,15,50,100,200,500,"1. 000",2000,5000,8000]
[null,null,null,null,null,null,null,null,null,null,null,null,null,null,null,null,null,1,"Công trình dân dụng",4.8000000000000001E-2,3.1800000000000002E-2,2.4899999999999999E-2,1.8599999999999998E-2,1.38E-2,1.14E-2,8.3999999999999995E-3,6.3E-3,5.4000000000000003E-3]
[null,null,null,null,null,null,null,null,null,null,null,null,null,null,null,null,null,2,"Công trình công nghiệp",5.5500000000000001E-2,3.6299999999999999E-2,2.8199999999999999E-2,2.1600000000000001E-2,1.6500000000000001E-2,1.23E-2,9.9000000000000008E-3,6.8999999999999999E-3,6.0000000000000001E-3]
[null,null,null,null,null,null,null,null,null,null,null,null,null,null,null,null,null,3,"Công trình giao thông",3.1800000000000002E-2,2.0400000000000001E-2,1.6199999999999999E-2,1.23E-2,9.2999999999999992E-3,7.1999999999999998E-3,6.0000000000000001E-3,4.1999999999999997E-3,3.5999999999999999E-3]
[null,null,null,null,null,null,null,null,null,null,null,null,null,null,null,null,null,4,"Công trình nông nghiệp và phát triển nông thôn",3.5099999999999999E-2,2.2800000000000001E-2,1.7999999999999999E-2,1.38E-2,1.0500000000000001E-2,7.7999999999999996E-3,6.6E-3,4.7999999999999996E-3,4.1999999999999997E-3]
[null,null,null,null,null,null,null,null,null,null,null,null,null,null,null,null,null,5,"Công trình hạ tầng kỹ thuật",3.6600000000000001E-2,2.46E-2,1.8599999999999998E-2,1.41E-2,1.11E-2,8.6999999999999994E-3,7.1999999999999998E-3,5.1000000000000004E-3,4.1999999999999997E-3]
[]
[]
[null,null,null,null,null,null,null,null,null,null,null,null,null,null,null,null,null,"(Ban hành kèm theo Thông tư số 258/2016/TT-BTC ngày 11 tháng 11 năm 2016 của Bộ trưởng Bộ Tài chính)"]
[]
[null,null,null,null,null,null,null,null,null,null,null,null,null,null,null,null,null,"STT","Tổng mức đầu tư (tỷ đồng) Tỷ lệ tính phí (%)",15,100,500,1000,5000,10000]
[null,null,null,null,null,null,null,null,null,null,null,null,null,null,null,null,null,1,"Dự án, công trình hạ tầng kỹ thuật, công trình giao thông",6.7099999999999998E-3,3.63E-3,2.0200000000000001E-3,1.3500000000000001E-3,7.5000000000000002E-4,5.0000000000000001E-4]
[null,null,null,null,null,null,null,null,null,null,null,null,null,null,null,null,null,2,"Dự án, công trình dầu khí, năng lượng, hóa chất",1.328E-2,7.1799999999999998E-3,3.9899999999999996E-3,2.66E-3,1.48E-3,9.8999999999999999E-4]
[null,null,null,null,null,null,null,null,null,null,null,null,null,null,null,null,null,3,"Dự án, công trình dân dụng, công nghiệp khác",9.6699999999999998E-3,5.2300000000000003E-3,2.9099999999999998E-3,1.9400000000000001E-3,1.08E-3,7.2000000000000005E-4]
[null,null,null,null,null,null,null,null,null,null,null,null,null,null,null,null,null,4,"Dự án, công trình khác",8.8800000000000007E-3,4.7999999999999996E-3,2.6700000000000001E-3,1.7799999999999999E-3,9.8999999999999999E-4,6.6E-4]

{"sheet":"Tổng hợp CPTB","index":8,"n_rows":31,"n_cols":10,"rows_kept":31,"cut":false,"hidden":true,"merged":[]}
[null,"BẢNG TỔNG HỢP DỰ TOÁN CHI PHÍ THIẾT BỊ"]
[null,"Tên dự án: Dự án đầu tư xây dựng công trình …"]
[null,"Tên công trình: Công trình xây dựng …"]
[null,"Thời điểm lập: ngày ... tháng ... năm 202…"]
[]
[null,"STT","NỘI DUNG CHI PHÍ","CÁCH TÍNH","GIÁ TRỊ TRƯỚC THUẾ","THUẾ GTGT","GIÁ TRỊ SAU THUẾ","KÝ HIỆU","Hệ số/ĐMTL"]
[null,1,"Chi phí mua sắm thiết bị công trình và thiết bị công nghệ",null,{"$f":"SUM(E8:E11)","v":0},{"$f":"SUM(F8:F11)","v":0},{"$f":"SUM(G8:G11)","v":0},"GMS"]
[null,"1.1",{"$f":"'Chi phí MSTB'!C8","v":"Loại thiết bị 1"},"Bảng CP mua sắm",{"$f":"'Chi phí MSTB'!J8","v":0},{"$f":"E8*0.1","v":0},{"$f":"E8+F8","v":0}]
[null,"1.2",{"$f":"'Chi phí MSTB'!C9","v":"Loại thiết bị 2"},"Bảng CP mua sắm",{"$f":"'Chi phí MSTB'!J9","v":0},{"$f":"E9*0.1","v":0},{"$f":"E9+F9","v":0}]
[null,"1.3",{"$f":"'Chi phí MSTB'!C10","v":"Loại thiết bị …"},"Bảng CP mua sắm",{"$f":"'Chi phí MSTB'!J10","v":0},0,0]
[null,null,null,"Bảng CP mua sắm",{"$f":"'Chi phí MSTB'!J11","v":0},0,0]
[]
[null,2,"Chi phí gia công, chế tạo thiết bị cần gia công (nếu có)",null,{"$f":"SUM(E14:E15)","v":0},{"$f":"SUM(F14:F15)","v":0},{"$f":"SUM(G14:G15)","v":0},"GGC"]
[null,"2.1",{"$f":"C8","v":"Loại thiết bị 1"},null,null,0,{"$f":"E14+F14","v":0}]
[null,"2.2","Loại thiết bị 2",null,null,0,0]
[null,3,"Chi phí quản lý mua sắm thiết bị (nếu có)","GMS*ĐMTL",{"$f":"E7*I16","v":0},0,0,"GQLMSTB",{"$f":"IF($G$7/1.1<=10000*10^9,1.1,IF($G$7/1.1>20000*10^9,0.9,1))/100","v":1.1000000000000001E-2}]
[null,4,"Chi phí mua bản quyền phần mềm sử dụng cho thiết bị công trình, thiết bị công nghệ (nếu có)",null,null,0,0,"GCN"]
[null,5,"Chi phí đào tạo và chuyển giao công nghệ (nếu có)",null,null,0,0,"GĐT"]
[null,6,"Chi phí lắp đặt, thí nghiệm, hiệu chỉnh",null,null,0,0,"GLĐ"]
[null,7,"Chi phí chạy thử thiết bị theo yêu cầu kỹ thuật",null,null,0,0,"GCT"]
[null,8,"Chi phí vận chuyển",null,null,null,null,"GVC"]
[null,9,"Chi phí khác có liên quan (nếu có)",null,null,0,0,"GK"]
[null,null,"TỔNG CỘNG (1+2+3+4+5+6+7+8+9)",null,{"$f":"E7+E16+E17+E18+E19+E20+E22","v":0},{"$f":"F7+F16+F17+F18+F19+F20+F22","v":0},{"$f":"G7+G13+G16+G17+G18+G19+G20+G21+G22","v":0},"GTB"]
[null,null,"Làm tròn"," ",{"$f":"ROUND(E23,-3)","v":0},0,{"$f":"ROUND(G23,-3)","v":0}]
[null,{"$f":"\"Bằng chữ: \"&doc_vnd(G24)&\"/.\"","v":"Bằng chữ:  đồng./."}]
[null,null,"NGƯỜI LẬP",null,null,"NGƯỜI CHỦ TRÌ"]
[]
[]
[null,null,null,null,null,"Chứng chỉ hành nghề định giá XD hạng …, số ..."]
[]
[null,null,null,null,null,null,null,null,null,"F"]

{"sheet":"Chi phí MSTB","index":9,"n_rows":27,"n_cols":10,"rows_kept":27,"cut":false,"hidden":true,"merged":[]}
[null,"BẢNG CHI PHÍ MUA SẮM THIẾT BỊ"]
[null,"Tên dự án: Dự án đầu tư xây dựng công trình …"]
[null,"Tên công trình: Công trình xây dựng …"]
[null,"Tên gói thầu: Thi công xây lắp …"]
[]
[null,"Stt","Loại thiết bị","Đơn vị","Số lượng","Giá gốc (Gg)","Chi phí vận chuyển (Ccvc)","Chi phí lưu kho (Clk)","Thuế và phí có liên quan (T)","Thành tiền"]
[null,0,2,"[3]","[4]",5,6,7,8,9]
[null,"1.1.1","Loại thiết bị 1","máy",null,null,null,null,null,{"$f":"E8*SUM(F8:I8)","v":0}]
[null,"1.1.2","Loại thiết bị 2","máy",null,null,null,null,null,{"$f":"E9*SUM(F9:I9)","v":0}]
[null,"1.1.3","Loại thiết bị …","máy",null,null,null,null,null,0]
[null,null,null,null,null,null,null,null,null,0]
[null,null,null,null,null,null,null,null,null,0]
[null,null,null,null,null,null,null,null,null,0]
[null,null,null,null,null,null,null,null,null,0]
[null,null,null,null,null,null,null,null,null,0]
[null,null,null,null,null,null,null,null,null,0]
[null,null,null,null,null,null,null,null,null,0]
[null,null,"TỔNG CỘNG",null,null,null,null,null,null,{"$f":"SUM(J8:J17)","v":0}]
[null,null,"LÀM TRÒN",null,null,null,null,null,null,{"$f":"ROUND(J18,-3)","v":0}]
[]
[null,"KHÔNG XÓA",null,null,"DO NOT REMOVE",null,"KHÔNG XÓA"]
[]
[null,null," - Gg: giá thiết bị ở nơi mua hay giá tính đến cảng Việt Nam và các phí bảo hiểm, thuế nhập khẩu,...theo quy định của pháp luật (đối với thiết bị nhập khẩu) đã bao gồm chi phí thiết kế và giám sát chế tạo thiết bị;"]
[null,null," - Cvc: chi phí vận chuyển một đơn vị khối lượng hoặc một đơn vị số lượng thiết bị (nhóm thiết bị) từ nơi mua hay từ cảng Việt Nam hoặc từ nơi gia công, chế tạo đến hiện trường công trình;"]
[null,null," - Clk: chi phí lưu kho, lưu bãi, lưu container một đơn vị khối lượng hoặc một đơn vị số lượng thiết bị (nhóm thiết bị) tại cảng Việt Nam đối với thiết bị nhập khẩu;"]
[null,null," - Cbq: chi phí bảo quản, bảo dưỡng một đơn vị khối lượng hoặc một đơn vị số lượng thiết bị (nhóm thiết bị) tại hiện trường;"]
[null,null," - T: các loại thuế và phí có liên quan."]

{"sheet":"THCP Tư vấn","index":10,"n_rows":12,"n_cols":7,"rows_kept":12,"cut":false,"hidden":true,"merged":[]}
[null,"BẢNG TỔNG HỢP DỰ TOÁN CHI PHÍ TƯ VẤN"]
[null,{"$f":"Info!$C$5&Info!$D$5","v":"Dự án: Dự án đầu tư xây dựng công trình …"}]
[null,{"$f":"Info!$C$6&Info!$D$6","v":"Công trình: Công trình xây dựng …"}]
[null,"STT","KHOẢN MỤC CHI PHÍ","DIỄN GIẢI","GIÁ TRỊ (ĐỒNG)","KÝ HIỆU","HỆ SỐ"]
[null,1,"Chi phí chuyên gia","Bảng tính",{"$f":"tbl_CPCG[[#Totals],[THÀNH TIỀN]]","v":0},"Ccg"]
[null,2,"Chi phí quản lý",{"$f":"G6*100&\"%*Ccg\"","v":"55%*Ccg"},{"$f":"E5*G6","v":0},"Cql",{"$f":"IF(E5<1*10^9,0.55,IF(E5<5*10^9,0.5,0.45))","v":0.55000000000000004}]
[null,3,"Chi phí khác","Bảng tính",{"$f":"tbl_TVkhac[[#Totals],[THÀNH TIỀN]]","v":126800000},"Ck"]
[null,4,"Thu nhập chịu thuế tính trước",{"$f":"G8*100&\"%*(Ccg+Cql)\"","v":"6%*(Ccg+Cql)"},{"$f":"SUM(E5:E6)*G8","v":0},"TN",0.06]
[null,5,"Thuế giá trị gia tăng",{"$f":"G9*100&\"%*(Ccg+Cql+Ck+TN)\"","v":"10%*(Ccg+Cql+Ck+TN)"},{"$f":"SUM(E5:E8)*G9","v":12680000},"VAT",0.1]
[null,6,"Chi phí dự phòng",{"$f":"G9*100&\"%*(Ccg+Cql+Ck+TN+VAT)\"","v":"10%*(Ccg+Cql+Ck+TN+VAT)"},{"$f":"SUM(E5:E9)*G10","v":6974000},"Cdp",0.05]
[null,null,"Tổng cộng","Ccg+Cql+Ck+TN+VAT+Cdp",{"$f":"SUM(E5:E10)","v":146454000},"Ctv"]
[null,null,"Làm tròn",null,{"$f":"ROUND(E11,-3)","v":146454000}]

{"sheet":"Mẫu Tổng hợp","index":11,"n_rows":315,"n_cols":10,"rows_kept":315,"cut":false,"hidden":true,"merged":[]}
[null,"BẢNG TỔNG HỢP DỰ TOÁN CHI PHÍ XÂY DỰNG"]
[null,{"$f":"\"Tên dự án: \"&Info!$D$5","v":"Tên dự án: Dự án đầu tư xây dựng công trình …"}]
[null,{"$f":"\"Tên công trình: \"&Info!$D$6","v":"Tên công trình: Công trình xây dựng …"}]
[null,"Thời điểm lập:",null,null,null,null,null,"FORM1-TT11/2021"]
[null,null,null,null,null,null,null,"PL3_TT11/2021"]
[null,"STT","NỘI DUNG CHI PHÍ","CÁCH TÍNH","GIÁ TRỊ","KÝ HIỆU","HỆ SỐ"]
[null,"I","CHI PHÍ TRỰC TIẾP"]
[null,1,"Chi phí vật liệu","VL",{"$f":"IF(MoEs<>4,E11,E9)","v":0},"VL"]
[null,null,"Chi phí vật liệu gốc","Bảng dự toán khối lượng",null,"VLg"]
[null,null,"Chênh lệch giá vật liệu","Bảng tổng hợp vật tư",null,"CLVL"]
[null,null,"Điều chỉnh hệ số","(VLg+CLVL)*Kvl",{"$f":"(E9+E10)*G11","v":0},"Hvl",{"$f":"Info!$D$20","v":1}]
[null,2,"Chi phí nhân công","NC",{"$f":"IF(MoEs<>4,E15,E13)","v":0},"NC"]
[null,null,"Chi phí nhân công gốc","Bảng dự toán khối lượng",null,"NCg"]
[null,null,"Chênh lệch giá nhân công","Bảng tổng hợp vật tư",null,"CLNC"]
[null,null,"Điều chỉnh hệ số","(NCg+CLNC)*Knc",{"$f":"(E13+E14)*G15","v":0},"Hnc",{"$f":"Info!$D$21","v":1}]
[null,3,"Chi phí máy thi công","M",{"$f":"IF(MoEs<>4,E19,E17)","v":0},"M"]
[null,null,"Chi phí máy thi công gốc","Bảng dự toán khối lượng",null,"Mg"]
[null,null,"Chênh lệch giá máy thi công","Bảng tổng hợp vật tư",null,"CLM"]
[null,null,"Điều chỉnh hệ số","(Mg+CLM)*Kmtc",{"$f":"(E17+E18)*G19","v":0},"Hm",{"$f":"Info!$D$22","v":1}]
["S",null,"Chi phí trực tiếp","VL + NC + M",{"$f":"E8+E12+E16","v":0},"T",null,"Chi phí Xây dựng | Phụ lục số 3 Thông tư 11/2021/TT-BXD",null,1]
[null,"II","CHI PHÍ GIÁN TIẾP",null,null,"_",null,null,null,2]
[null,1,"Chi phí chung",{"$f":"IF(Info!$C$23=\"Định mức chi phí chung tính trên chi phí trực tiếp (C)\",\"T x \"&ROUND(G22*100,3)&\"%\",IF(Info!$C$23=\"Định mức chi phí chung tính trên chi phí nhân công (C)\",\"NC x \"&ROUND(G22*100,3)&\"%\"))","v":"T x 7,3%"},{"$f":"IF(Info!$C$23=\"Định mức chi phí chung tính trên chi phí trực tiếp (C)\",E20*G22,IF(Info!$C$23=\"Định mức chi phí chung tính trên chi phí nhân công (C)\",E12*G22))","v":0},"C",{"$f":"Info!$D$23","v":7.2999999999999995E-2},null,null,3]
[null,2,"Chi phí nhà tạm để ở và điều hành thi công",{"$f":"\"T x \"&ROUND(G23*100,3)&\"%\"","v":"T x 1,1%"},{"$f":"E20*G23","v":0},"LT",{"$f":"Info!$D$26","v":1.1000000000000001E-2},null,null,4]
[null,3,"Chi phí một số công việc không xác định được khối lượng từ thiết kế",{"$f":"\"T x \"&ROUND(G24*100,3)&\"%\"","v":"T x 2,5%"},{"$f":"E20*G24","v":0},"TT",{"$f":"Info!$D$27","v":2.5000000000000001E-2},null,null,5]
[null,null,"Chi phí gián tiếp","C + LT + TT",{"$f":"E22+E23+E24","v":0},"GT",null,null,null,6]
[null,"III","THU NHẬP CHỊU THUẾ TÍNH TRƯỚC",{"$f":"\"(T + GT) x \"&G26*100&\"%\"","v":"(T + GT) x 5,5%"},{"$f":"(E20+E25)*G26","v":0},"TL",{"$f":"Info!$D$24","v":5.5E-2},null,null,7]
[null,null,"Chi phí xây dựng trước thuế","T + GT + TL",{"$f":"E20+E25+E26","v":0},"G",null,null,null,8]
[null,"IV","THUẾ GIÁ TRỊ GIA TĂNG",{"$f":"\"G x \"&ROUND(G28*100,3)&\"%\"","v":"G x 10%"},{"$f":"E27*G28","v":0},"GTGT",{"$f":"Info!$D$25","v":0.1},null,null,9]
[null,null,"Chi phí xây dựng sau thuế","G + GTGT",{"$f":"E28+E27","v":0},"GXD",null,null,null,10]
[null,null,"Làm tròn"," ",{"$f":"ROUND(E29,-3)","v":0},null,null,null,null,11]
[null,{"$f":"\"Bằng chữ: \"&doc_vnd(E30)&\"/.\"","v":"Bằng chữ:  đồng./."},null,null,null,null,null,null,null,12]
[null,null,null,null,null,null,null,null,null,13]
[null,null,"NGƯỜI LẬP",null,"NGƯỜI CHỦ TRÌ",null,null,null,null,14]
[null,null,null,null,null,null,null,null,null,15]
[null,null,null,null,null,null,null,null,null,16]
[null,null,null,null,null,null,null,null,null,17]
[null,null,null,null,null,null,null,null,null,18]
[null,null,null,null,null,null,null,null,null,19]
[null,null,null,null,"Chứng chỉ hành nghề định giá XD hạng….., số…………",null,null,null,null,20]
[null,null,null,null,null,null,null,null,null,21]
[null,null,null,null,null,null,null,null,null,22]
[null,null,null,null,null,null,null,"F",null,23]
[]
[null,"TỔNG HỢP DỰ TOÁN CHI PHÍ XÂY DỰNG"]
[null,{"$f":"\"Tên dự án: \"&Info!$D$5","v":"Tên dự án: Dự án đầu tư xây dựng công trình …"}]
[null,{"$f":"\"Tên công trình: \"&Info!$D$6","v":"Tên công trình: Công trình xây dựng …"}]
[null,"Thời điểm lập:",null,null,null,null,null,"FORM2-TT11/2021"]
[null,null,null,null,null,null,null,"PL5_TT11/2021"]
[null,"STT","NỘI DUNG CHI PHÍ","CÁCH TÍNH","GIÁ TRỊ","KÝ HIỆU","HỆ SỐ"]
[null,"I","CHI PHÍ TRỰC TIẾP"]
[null,1,"Chi phí vật liệu","VLks",{"$f":"IF(MoEs<>4,E54,E52)","v":0},"VLks"]
[null,null,"Chi phí vật liệu gốc","Bảng dự toán khối lượng",null,"VLg"]
[null,null,"Chênh lệch giá vật liệu","Bảng tổng hợp vật tư",null,"CLVL"]
[null,null,"Điều chỉnh hệ số","(VLg+CLVL)*Kvl",{"$f":"(E52+E53)*G54","v":0},"Hvl",{"$f":"Info!$D$20","v":1}]
[null,2,"Chi phí nhân công","NCks",{"$f":"IF(MoEs<>4,E58,E56)","v":0},"NCks"]
[null,null,"Chi phí nhân công gốc","Bảng dự toán khối lượng",null,"NCg"]
[null,null,"Chênh lệch giá nhân công","Bảng tổng hợp vật tư",null,"CLNC"]
[null,null,"Điều chỉnh hệ số","(NCg+CLNC)*Knc",{"$f":"(E56+E57)*G58","v":0},"Hnc",{"$f":"Info!$D$21","v":1}]
[null,3,"Chi phí máy thi công","Mks",{"$f":"IF(MoEs<>4,E62,E60)","v":0},"Mks"]
[null,null,"Chi phí máy thi công gốc","Bảng dự toán khối lượng",null,"Mg"]
[null,null,"Chênh lệch giá máy thi công","Bảng tổng hợp vật tư",null,"CLM"]
[null,null,"Điều chỉnh hệ số","(Mg+CLM)*Kmtc",{"$f":"(E60+E61)*G62","v":0},"Hm",{"$f":"Info!$D$22","v":1}]
["S",null,"Chi phí trực tiếp","VL + NC + M",{"$f":"E51+E55+E59","v":0},"T",null,"Chi phí Khảo sát | Phụ lục số 5 Thông tư 11/2021/TT-BXD",null,1]
[null,"II","CHI PHÍ GIÁN TIẾP",null,null,"_",null,null,null,2]
[null,1,"Chi phí chung",{"$f":"\"NC x \"&ROUND(G65*100,3)&\"%\"","v":"NC x 70%"},{"$f":"E55*G65","v":0},"C",{"$f":"IF(E55/10^9<=1,70%,IF(AND(E55/10^9>1,E55/10^9<=2),65%,60%))","v":0.7},null,null,3]
[null,2,"Chi phí nhà tạm để ở và điều hành thi công",{"$f":"\"T x \"&ROUND(G66*100,3)&\"%\"","v":"T x 1,1%"},{"$f":"E63*G66","v":0},"LT",{"$f":"Info!$D$26","v":1.1000000000000001E-2},null,null,4]
[null,3,"Chi phí một số công việc không xác định được khối lượng từ thiết kế",{"$f":"\"T x \"&ROUND(G67*100,3)&\"%\"","v":"T x 2,5%"},{"$f":"E63*G67","v":0},"TT",{"$f":"Info!$D$27","v":2.5000000000000001E-2},null,null,5]
[null,null,"Chi phí gián tiếp","C + LT + TT",{"$f":"E65+E66+E67","v":0},"GT",null,null,null,6]
[null,"III","THU NHẬP CHỊU THUẾ TÍNH TRƯỚC",{"$f":"\"(T + GT) x \"&G69*100&\"%\"","v":"(T + GT) x 6%"},{"$f":"(E63+E68)*G69","v":0},"TL",0.06,null,null,7]
[null,"IV","CHI PHÍ KHÁC PHỤC VỤ CÔNG TÁC KHẢO SÁT XÂY DỰNG",null,null,"_",null,null,null,8]
[null,null,"Chi phí lập phương án kỹ thuật khảo sát",{"$f":"\"T x \"&G71*100&\"%\"","v":"T x 2%"},{"$f":"E63*G71","v":0},"Cpa",{"$f":"IF((E63+E68)/10^9<=2,2%,1.5%)","v":0.02},null,null,9]
[null,null,"Chi phí lập báo cáo kết quả khảo sát",{"$f":"\"T x \"&G72*100&\"%\"","v":"T x 3%"},{"$f":"E63*G72","v":0},"Cbc",{"$f":"IF((E63+E68)/10^9<=2,3%,2.5%)","v":0.03},null,null,10]
[null,null,"Chi phí khác phục vụ công tác khảo sát xây dựng","Cpa + Cbc",{"$f":"E71+E72","v":0},"Cpvks",null,null,null,11]
[null,null,"Chi phí khảo sát trước thuế","T + GT + Cpvks",{"$f":"E63+E68+E73","v":0},"G",null,null,null,12]
[null,"V","THUẾ GIÁ TRỊ GIA TĂNG",{"$f":"\"G x \"&ROUND(G75*100,3)&\"%\"","v":"G x 10%"},{"$f":"E74*G75","v":0},"GTGT",{"$f":"Info!$D$25","v":0.1},null,null,13]
[null,null,"Chi phí khảo sát xây dựng sau thuế","G + GTGT",{"$f":"E75+E74","v":0},"Gcpks",null,null,null,14]
[null,"VII","CHI PHÍ DỰ PHÒNG",{"$f":"\"Gcpks x \"&G77*100&\"%\"","v":"Gcpks x 10%"},{"$f":"E76*G77","v":0},"Cdp",{"$f":"Info!$D$25","v":0.1},null,null,15]
[null,null,"Tổng cộng:","Gcpks + Cdp",{"$f":"E77+E76","v":0},"Gks",null,null,null,16]
[null,null,"Làm tròn"," ",{"$f":"ROUND(E78,-3)","v":0},null,null,null,null,17]
[null,{"$f":"\"Bằng chữ: \"&doc_vnd(E79)&\"/.\"","v":"Bằng chữ:  đồng./."},null,null,null,null,null,null,null,18]
[null,null,"NGƯỜI LẬP",null,"NGƯỜI CHỦ TRÌ",null,null,null,null,19]
[null,null,null,null,null,null,null,null,null,20]
[null,null,null,null,null,null,null,null,null,21]
[null,null,null,null,null,null,null,null,null,22]
[null,null,null,null,"Chứng chỉ hành nghề định giá XD hạng….., số…………",null,null,null,null,23]
[null,null,null,null,null,null,null,"F",null,24]
[]
[null,"BẢNG TỔNG HỢP DỰ TOÁN CHI PHÍ XÂY DỰNG"]
[null,{"$f":"\"Tên dự án: \"&Info!$D$5","v":"Tên dự án: Dự án đầu tư xây dựng công trình …"}]
[null,{"$f":"\"Tên công trình: \"&Info!$D$6","v":"Tên công trình: Công trình xây dựng …"}]
[null,"Thời điểm lập:",null,null,null,null,null,"FORM1-TT14/2017"]
[null,null,null,null,null,null,null,"TT14/2017"]
[null,"STT","NỘI DUNG CHI PHÍ","CÁCH TÍNH","GIÁ TRỊ","KÝ HIỆU","HỆ SỐ"]
[null,"I","CHI PHÍ TRỰC TIẾP"]
[null,1,"Chi phí vật liệu","VL",{"$f":"IF(MoEs<>4,E98,E96)","v":0},"VL"]
[null,null,"Chi phí vật liệu gốc","Bảng dự toán khối lượng",null,"VLg"]
[null,null,"Chênh lệch giá vật liệu","Bảng tổng hợp vật tư",null,"CLVL"]
[null,null,"Điều chỉnh hệ số","(VLg+CLVL)*Kvl",{"$f":"(E96+E97)*G98","v":0},"Hvl",{"$f":"Info!$D$20","v":1}]
[null,2,"Chi phí nhân công","NC",{"$f":"IF(MoEs<>4,E102,E100)","v":0},"NC"]
[null,null,"Chi phí nhân công gốc","Bảng dự toán khối lượng",null,"NCg"]
[null,null,"Chênh lệch giá nhân công","Bảng tổng hợp vật tư",null,"CLNC"]
[null,null,"Điều chỉnh hệ số","(NCg+CLNC)*Knc",{"$f":"(E100+E101)*G102","v":0},"Hnc",{"$f":"Info!$D$21","v":1}]
[null,3,"Chi phí sử dụng xe, máy, thiết bị thi công","M",{"$f":"IF(MoEs<>4,E106,E104)","v":0},"M"]
[null,null,"Chi phí máy thi công gốc","Bảng dự toán khối lượng",null,"Mg"]
[null,null,"Chênh lệch giá máy thi công","Bảng tổng hợp vật tư",null,"CLM"]
[null,null,"Điều chỉnh hệ số","(Mg+CLM)*Kmtc",{"$f":"(E104+E105)*G106","v":0},"Hm",{"$f":"Info!$D$22","v":1}]
["S",null,"Chi phí trực tiếp","VL + NC + M",{"$f":"E95+E99+E103","v":0},"T",null,"Chi phí Dịch vụ công ích đô thị | Thông tư 14/2017/TT-BXD"]
[null,"II","CHI PHÍ QUẢN LÝ CHUNG",{"$f":"IF(E103>60%*E107,\"M x \"&ROUND(G108*100,3)&\"%\",\"NC x \"&ROUND(G108*100,3)&\"%\")","v":"NC x 7,3%"},{"$f":"IF(E103>60%*E107,E103*G108,E99*G108)","v":0},"C",{"$f":"Info!$D$23","v":7.2999999999999995E-2}]
[null,"III","LỢI NHUẬN ĐỊNH MỨC",{"$f":"\"(T + C) x \"&G109*100&\"%\"","v":"(T + C) x 5,5%"},{"$f":"(E107+E108)*G109","v":0},"LN",{"$f":"Info!$D$24","v":5.5E-2}]
[null,"IV","THUẾ GIÁ TRỊ GIA TĂNG",{"$f":"\"G x \"&ROUND(G110*100,3)&\"%\"","v":"G x 10%"},{"$f":"(E107+E108+E109)*G110","v":0},"GTGT",{"$f":"Info!$D$25","v":0.1}]
[null,null,"DỰ TOÁN CHI PHÍ DVCI ĐÔ THỊ ","T + C + LN + GTGT",{"$f":"SUM(E107:E110)","v":0},"DTCP"]
[null,null,"Làm tròn"," ",{"$f":"ROUND(E111,-3)","v":0}]
[null,{"$f":"\"Bằng chữ: \"&doc_vnd(E112)&\"/.\"","v":"Bằng chữ:  đồng./."}]
[null,null,"NGƯỜI LẬP",null,"NGƯỜI CHỦ TRÌ"]
[]
[]
[]
[]
[]
[null,null,null,null,"Chứng chỉ hành nghề định giá XD hạng….., số…………"]
[]
[null,null,null,null,null,null,null,"F"]
[]
[null,"BẢNG TỔNG HỢP DỰ TOÁN CHI PHÍ XÂY DỰNG"]
[null,{"$f":"\"Tên dự án: \"&Info!$D$5","v":"Tên dự án: Dự án đầu tư xây dựng công trình …"}]
[null,{"$f":"\"Tên công trình: \"&Info!$D$6","v":"Tên công trình: Công trình xây dựng …"}]
[null,"Thời điểm lập:",null,null,null,null,null,"FORM1-TT09/2019"]
[null,null,null,null,null,null,null,"PL3_TT09/2019"]
[null,"STT","NỘI DUNG CHI PHÍ","CÁCH TÍNH","GIÁ TRỊ","KÝ HIỆU","HỆ SỐ"]
[null,"I","CHI PHÍ TRỰC TIẾP"]
[null,1,"Chi phí vật liệu","VL",{"$f":"IF(MoEs<>4,E134,E132)","v":0},"VL"]
[null,null,"Chi phí vật liệu gốc","Bảng dự toán khối lượng",null,"VLg"]
[null,null,"Chênh lệch giá vật liệu","Bảng tổng hợp vật tư",null,"CLVL"]
[null,null,"Điều chỉnh hệ số","(VLg+CLVL)*Kvl",{"$f":"(E132+E133)*G134","v":0},"Hvl",{"$f":"Info!$D$20","v":1}]
[null,2,"Chi phí nhân công","NC",{"$f":"IF(MoEs<>4,E138,E136)","v":0},"NC"]
[null,null,"Chi phí nhân công gốc","Bảng dự toán khối lượng",null,"NCg"]
[null,null,"Chênh lệch giá nhân công","Bảng tổng hợp vật tư",null,"CLNC"]
[null,null,"Điều chỉnh hệ số","(NCg+CLNC)*Knc",{"$f":"(E136+E137)*G138","v":0},"Hnc",{"$f":"Info!$D$21","v":1}]
[null,3,"Chi phí máy thi công","M",{"$f":"IF(MoEs<>4,E142,E140)","v":0},"M"]
[null,null,"Chi phí máy thi công gốc","Bảng dự toán khối lượng",null,"Mg"]
[null,null,"Chênh lệch giá máy thi công","Bảng tổng hợp vật tư",null,"CLM"]
[null,null,"Điều chỉnh hệ số","(Mg+CLM)*Kmtc",{"$f":"(E140+E141)*G142","v":0},"Hm",{"$f":"Info!$D$22","v":1}]
["S",null,"Chi phí trực tiếp","VL + NC + M",{"$f":"E131+E135+E139","v":0},"T",null,"Chi phí Xây dựng | Phụ lục số 3 Thông tư 09/2019/TT-BXD",null,1]
[null,"II","CHI PHÍ GIÁN TIẾP",null,null,"_",null,null,null,2]
[null,1,"Chi phí chung",{"$f":"IF(Info!$C$23=\"Định mức chi phí chung tính trên chi phí trực tiếp (C)\",\"T x \"&ROUND(G145*100,3)&\"%\",IF(Info!$C$23=\"Định mức chi phí chung tính trên chi phí nhân công (C)\",\"NC x \"&ROUND(G145*100,3)&\"%\"))","v":"T x 7,3%"},{"$f":"IF(Info!$C$23=\"Định mức chi phí chung tính trên chi phí trực tiếp (C)\",E143*G145,IF(Info!$C$23=\"Định mức chi phí chung tính trên chi phí nhân công (C)\",E135*G145))","v":0},"C",{"$f":"Info!$D$23","v":7.2999999999999995E-2},null,null,3]
[null,2,"Chi phí nhà tạm để ở và điều hành thi công",{"$f":"\"T x \"&ROUND(G146*100,3)&\"%\"","v":"T x 1,1%"},{"$f":"E143*G146","v":0},"LT",{"$f":"Info!$D$26","v":1.1000000000000001E-2},null,null,4]
[null,3,"Chi phí một số công việc không xác định được khối lượng từ thiết kế",{"$f":"\"T x \"&ROUND(G147*100,3)&\"%\"","v":"T x 2,5%"},{"$f":"E143*G147","v":0},"TT",{"$f":"Info!$D$27","v":2.5000000000000001E-2},null,null,5]
[null,null,"Chi phí gián tiếp","C + LT + TT",{"$f":"E145+E146+E147","v":0},"GT",null,null,null,6]
[null,"III","THU NHẬP CHỊU THUẾ TÍNH TRƯỚC",{"$f":"\"(T + GT) x \"&G149*100&\"%\"","v":"(T + GT) x 5,5%"},{"$f":"(E143+E148)*G149","v":0},"TL",{"$f":"Info!$D$24","v":5.5E-2},null,null,7]
[null,null,"Chi phí xây dựng trước thuế","T + GT + TL",{"$f":"E143+E148+E149","v":0},"G",null,null,null,8]
[null,"IV","THUẾ GIÁ TRỊ GIA TĂNG",{"$f":"\"G x \"&ROUND(G151*100,3)&\"%\"","v":"G x 10%"},{"$f":"E150*G151","v":0},"GTGT",{"$f":"Info!$D$25","v":0.1},null,null,9]
[null,null,"Chi phí xây dựng sau thuế","G + GTGT",{"$f":"E151+E150","v":0},"GXD",null,null,null,10]
[null,null,"Làm tròn"," ",{"$f":"ROUND(E152,-3)","v":0},null,null,null,null,11]
[null,{"$f":"\"Bằng chữ: \"&doc_vnd(E153)&\"/.\"","v":"Bằng chữ:  đồng./."},null,null,null,null,null,null,null,12]
[null,null,null,null,null,null,null,null,null,13]
[null,null,"NGƯỜI LẬP",null,"NGƯỜI CHỦ TRÌ",null,null,null,null,14]
[null,null,null,null,null,null,null,null,null,15]
[null,null,null,null,null,null,null,null,null,16]
[null,null,null,null,null,null,null,null,null,17]
[null,null,null,null,null,null,null,null,null,18]
[null,null,null,null,null,null,null,null,null,19]
[null,null,null,null,"Chứng chỉ hành nghề định giá XD hạng….., số…………",null,null,null,null,20]
[null,null,null,null,null,null,null,null,null,21]
[null,null,null,null,null,null,null,null,null,22]
[null,null,null,null,null,null,null,"F",null,23]
[null,"TỔNG HỢP DỰ TOÁN CHI PHÍ XÂY DỰNG"]
[null,{"$f":"\"Tên dự án: \"&Info!$D$5","v":"Tên dự án: Dự án đầu tư xây dựng công trình …"}]
[null,{"$f":"\"Tên công trình: \"&Info!$D$6","v":"Tên công trình: Công trình xây dựng …"}]
[null,"Thời điểm lập:",null,null,null,null,null,"FORM1"]
[null,null,null,null,null,null,null,"TT06"]
[null,"STT","NỘI DUNG CHI PHÍ","CÁCH TÍNH","GIÁ TRỊ","KÝ HIỆU","HỆ SỐ"]
[null,"I","CHI PHÍ TRỰC TIẾP"]
[null,1,"Chi phí vật liệu","VL",{"$f":"IF(MoEs<>4,E176,E174)","v":0},"VL"]
[null,null,"Chi phí vật liệu gốc","Bảng dự toán khối lượng",null,"VLg"]
[null,null,"Chênh lệch giá vật liệu","Bảng tổng hợp vật tư",null,"CLVL"]
[null,null,"Điều chỉnh hệ số","(VLg+CLVL)*Kvl",{"$f":"IF(OR(MoEs=2,MoEs=3),(E174+E175)*G176,0)","v":0},"Hvl",{"$f":"Info!$D$20","v":1}]
[null,2,"Chi phí nhân công","NC",{"$f":"IF(MoEs<>4,E180,E178)","v":0},"NC"]
[null,null,"Chi phí nhân công gốc","Bảng dự toán khối lượng",null,"NCg"]
[null,null,"Chênh lệch giá nhân công","Bảng tổng hợp vật tư",null,"CLNC"]
[null,null,"Điều chỉnh hệ số","(NCg+CLNC)*Knc",{"$f":"IF(OR(MoEs=2,MoEs=3),(E178+E179)*G180,0)","v":0},"Hnc",{"$f":"Info!$D$21","v":1}]
[null,3,"Chi phí máy thi công","M",{"$f":"IF(MoEs<>4,E184,E182)","v":0},"M"]
[null,null,"Chi phí máy thi công gốc","Bảng dự toán khối lượng",null,"Mg"]
[null,null,"Chênh lệch giá máy thi công","Bảng tổng hợp vật tư",null,"CLM"]
[null,null,"Điều chỉnh hệ số","(Mg+CLM)*Kmtc",{"$f":"IF(OR(MoEs=2,MoEs=3),(E182+E183)*G184,0)","v":0},"Hm",{"$f":"Info!$D$22","v":1}]
["S",null,"Chi phí trực tiếp","VL + NC + M",{"$f":"E173+E177+E181","v":0},"T",null,"Chi phí Xây dựng | Thông tư 06/2016/TT-BXD"]
[null,"II","CHI PHÍ CHUNG",{"$f":"IF(Info!$C$23=\"Định mức chi phí chung tính trên chi phí trực tiếp (C)\",\"T x \"&ROUND(G186*100,3)&\"%\",IF(Info!$C$23=\"Định mức chi phí chung tính trên chi phí nhân công (C)\",\"NC x \"&ROUND(G186*100,3)&\"%\"))","v":"T x 7,3%"},{"$f":"IF(Info!$C$23=\"Định mức chi phí chung tính trên chi phí trực tiếp (C)\",E185*G186,IF(Info!$C$23=\"Định mức chi phí chung tính trên chi phí nhân công (C)\",E177*G186))","v":0},"C",{"$f":"Info!$D$23","v":7.2999999999999995E-2}]
[null,"III","THU NHẬP CHỊU THUẾ TÍNH TRƯỚC",{"$f":"\"(T + C) x \"&G187*100&\"%\"","v":"(T + C) x 5,5%"},{"$f":"(E185+E186)*G187","v":0},"TL",{"$f":"Info!$D$24","v":5.5E-2}]
[null,null,"Chi phí xây dựng trước thuế","T + C + TL",{"$f":"E185+E186+E187","v":0},"G"]
[null,"IV","THUẾ GIÁ TRỊ GIA TĂNG",{"$f":"\"G x \"&ROUND(G189*100,3)&\"%\"","v":"G x 10%"},{"$f":"E188*G189","v":0},"GTGT",{"$f":"Info!$D$25","v":0.1}]
[null,null,"Chi phí xây dựng sau thuế","G + GTGT",{"$f":"E189+E188","v":0},"Gxdtt"]
[null,null,"Làm tròn"," ",{"$f":"ROUND(E190,-3)","v":0}]
[null,{"$f":"\"Bằng chữ: \"&doc_vnd(E191)&\"/.\"","v":"Bằng chữ:  đồng./."}]
[null,null,"NGƯỜI LẬP",null,"NGƯỜI CHỦ TRÌ"]
[]
[]
[null,null,null,null,"Chứng chỉ hành nghề định giá XD hạng….., số…………"]
[]
[]
[]
[null,null,null,null,null,null,null,"F"]
[]
[null,"TỔNG HỢP DỰ TOÁN CHI PHÍ XÂY DỰNG"]
[null,{"$f":"Info!$C$5&Info!$D$5","v":"Dự án: Dự án đầu tư xây dựng công trình …"}]
[null,{"$f":"Info!$C$6&Info!$D$6","v":"Công trình: Công trình xây dựng …"}]
[null,"HẠNG MỤC/WORK ITEM : ...",null,null,null,null,null,"FORM1-TT06"]
[null,null,null,null,null,null,null,"TT06"]
[null,"STT","NỘI DUNG CHI PHÍ","CÁCH TÍNH","GIÁ TRỊ","KÝ HIỆU","HỆ SỐ"]
[null,"I","CHI PHÍ TRỰC TIẾP"]
[null,1,"Chi phí vật liệu","VL",{"$f":"IF(MoEs<>4,E212,E210)","v":0},"VL"]
[null,null,"Chi phí vật liệu gốc","Bảng dự toán khối lượng",null,"VLg"]
[null,null,"Chênh lệch giá vật liệu","Bảng tổng hợp vật tư",null,"CLVL"]
[null,null,"Điều chỉnh hệ số","(VLg+CLVL)*Kvl",{"$f":"IF(OR(MoEs=2,MoEs=3),(E210+E211)*G212,0)","v":0},"Hvl",{"$f":"Info!$D$20","v":1}]
[null,2,"Chi phí nhân công","NC",{"$f":"IF(MoEs<>4,E216,E214)","v":0},"NC"]
[null,null,"Chi phí nhân công gốc","Bảng dự toán khối lượng",null,"NCg"]
[null,null,"Chênh lệch giá nhân công","Bảng tổng hợp vật tư",null,"CLNC"]
[null,null,"Điều chỉnh hệ số","(NCg+CLNC)*Knc",{"$f":"IF(OR(MoEs=2,MoEs=3),(E214+E215)*G216,0)","v":0},"Hnc",{"$f":"Info!$D$21","v":1}]
[null,3,"Chi phí máy thi công","M",{"$f":"IF(MoEs<>4,E220,E218)","v":0},"M"]
[null,null,"Chi phí máy thi công gốc","Bảng dự toán khối lượng",null,"Mg"]
[null,null,"Chênh lệch giá máy thi công","Bảng tổng hợp vật tư",null,"CLM"]
[null,null,"Điều chỉnh hệ số","(Mg+CLM)*Kmtc",{"$f":"IF(OR(MoEs=2,MoEs=3),(E218+E219)*G220,0)","v":0},"Hm",{"$f":"Info!$D$22","v":1}]
["S",null,"Chi phí trực tiếp","VL + NC + M",{"$f":"E209+E213+E217","v":0},"T",null,"Mẫu Dự thầu HĐ đơn giá cố định"]
[null,"II","CHI PHÍ CHUNG",{"$f":"IF(Info!$C$23=\"Định mức chi phí chung tính trên chi phí trực tiếp (C)\",\"T x \"&ROUND(G222*100,3)&\"%\",IF(Info!$C$23=\"Định mức chi phí chung tính trên chi phí nhân công (C)\",\"NC x \"&ROUND(G222*100,3)&\"%\"))","v":"T x 7,3%"},{"$f":"IF(Info!$C$23=\"Định mức chi phí chung tính trên chi phí trực tiếp (C)\",E221*G222,IF(Info!$C$23=\"Định mức chi phí chung tính trên chi phí nhân công (C)\",E213*G222))","v":0},"C",{"$f":"Info!$D$23","v":7.2999999999999995E-2}]
[null,"III","THU NHẬP CHỊU THUẾ TÍNH TRƯỚC",{"$f":"\"(T + C) x \"&G223*100&\"%\"","v":"(T + C) x 5,5%"},{"$f":"(E221+E222)*G223","v":0},"TL",{"$f":"Info!$D$24","v":5.5E-2}]
[null,null,"Chi phí xây dựng trước thuế","T + C + TL",{"$f":"E221+E222+E223","v":0},"G"]
[null,"IV","THUẾ GIÁ TRỊ GIA TĂNG",{"$f":"\"G x \"&ROUND(G225*100,3)&\"%\"","v":"G x 10%"},{"$f":"E224*G225","v":0},"GTGT",{"$f":"Info!$D$25","v":0.1}]
[null,null,"Chi phí xây dựng sau thuế","G + GTGT",{"$f":"E225+E224","v":0},"Gst"]
[null,null,"Chi phí dự phòng trượt giá",{"$f":"\"Gst x \"&ROUND(G227*100,3)&\"%\"","v":"Gst x 8%"},{"$f":"E226*G227","v":0},"Gdp2",{"$f":"Info!$D$29","v":0.08}]
[null,null,"Đơn giá dự thầu","Gst + Gdp2",{"$f":"E226+E227","v":0},"Gdt"]
[null,null,"Làm tròn"," ",{"$f":"ROUND(E228,-3)","v":0}]
[null,{"$f":"\"Bằng chữ: \"&doc_vnd(E229)&\"/.\"","v":"Bằng chữ:  đồng./."}]
[null,null,"NGƯỜI LẬP",null,"NGƯỜI CHỦ TRÌ"]
[]
[]
[null,null,null,null,"Chứng chỉ hành nghề định giá XD hạng….., số…………"]
[]
[]
[]
[null,null,null,null,null,null,null,"F"]
[]
[null,"TỔNG HỢP DỰ TOÁN CHI PHÍ XÂY DỰNG"]
[null,{"$f":"Info!$C$5&Info!$D$5","v":"Dự án: Dự án đầu tư xây dựng công trình …"}]
[null,{"$f":"Info!$C$6&Info!$D$6","v":"Công trình: Công trình xây dựng …"}]
[null,"HẠNG MỤC/WORK ITEM : ...",null,null,null,null,null,"FORM1-TT06"]
[null,null,null,null,null,null,null,"TT06"]
[null,"STT","NỘI DUNG CHI PHÍ","CÁCH TÍNH","GIÁ TRỊ","KÝ HIỆU","HỆ SỐ"]
[null,"I","CHI PHÍ TRỰC TIẾP"]
[null,1,"Chi phí vật liệu","VL",{"$f":"IF(MoEs<>4,E250,E248)","v":0},"VL"]
[null,null,"Chi phí vật liệu gốc","Bảng dự toán khối lượng",null,"VLg"]
[null,null,"Chênh lệch giá vật liệu","Bảng tổng hợp vật tư",null,"CLVL"]
[null,null,"Điều chỉnh hệ số","(VLg+CLVL)*Kvl",{"$f":"IF(OR(MoEs=2,MoEs=3),(E248+E249)*G250,0)","v":0},"Hvl",{"$f":"Info!$D$20","v":1}]
[null,2,"Chi phí nhân công","NC",{"$f":"IF(MoEs<>4,E254,E252)","v":0},"NC"]
[null,null,"Chi phí nhân công gốc","Bảng dự toán khối lượng",null,"NCg"]
[null,null,"Chênh lệch giá nhân công","Bảng tổng hợp vật tư",null,"CLNC"]
[null,null,"Điều chỉnh hệ số","(NCg+CLNC)*Knc",{"$f":"IF(OR(MoEs=2,MoEs=3),(E252+E253)*G254,0)","v":0},"Hnc",{"$f":"Info!$D$21","v":1}]
[null,3,"Chi phí máy thi công","M",{"$f":"IF(MoEs<>4,E258,E256)","v":0},"M"]
[null,null,"Chi phí máy thi công gốc","Bảng dự toán khối lượng",null,"Mg"]
[null,null,"Chênh lệch giá máy thi công","Bảng tổng hợp vật tư",null,"CLM"]
[null,null,"Điều chỉnh hệ số","(Mg+CLM)*Kmtc",{"$f":"IF(OR(MoEs=2,MoEs=3),(E256+E257)*G258,0)","v":0},"Hm",{"$f":"Info!$D$22","v":1}]
["S",null,"Chi phí trực tiếp","VL + NC + M",{"$f":"E247+E251+E255","v":0},"T",null,"Mẫu Dự thầu HĐ đơn giá điều chỉnh"]
[null,"II","CHI PHÍ CHUNG",{"$f":"IF(Info!$C$23=\"Định mức chi phí chung tính trên chi phí trực tiếp (C)\",\"T x \"&ROUND(G260*100,3)&\"%\",IF(Info!$C$23=\"Định mức chi phí chung tính trên chi phí nhân công (C)\",\"NC x \"&ROUND(G260*100,3)&\"%\"))","v":"T x 7,3%"},{"$f":"IF(Info!$C$23=\"Định mức chi phí chung tính trên chi phí trực tiếp (C)\",E259*G260,IF(Info!$C$23=\"Định mức chi phí chung tính trên chi phí nhân công (C)\",E251*G260))","v":0},"C",{"$f":"Info!$D$23","v":7.2999999999999995E-2}]
[null,"III","THU NHẬP CHỊU THUẾ TÍNH TRƯỚC",{"$f":"\"(T + C) x \"&G261*100&\"%\"","v":"(T + C) x 5,5%"},{"$f":"(E259+E260)*G261","v":0},"TL",{"$f":"Info!$D$24","v":5.5E-2}]
[null,null,"Chi phí xây dựng trước thuế","T + C + TL",{"$f":"E259+E260+E261","v":0},"G"]
[null,"IV","THUẾ GIÁ TRỊ GIA TĂNG",{"$f":"\"G x \"&ROUND(G263*100,3)&\"%\"","v":"G x 10%"},{"$f":"E262*G263","v":0},"GTGT",{"$f":"Info!$D$25","v":0.1}]
[null,null,"Đơn giá dự thầu","G + GTGT",{"$f":"E263+E262","v":0},"Gdt"]
[null,null,"Làm tròn"," ",{"$f":"ROUND(E264,-3)","v":0}]
[null,{"$f":"\"Bằng chữ: \"&doc_vnd(E265)&\"/.\"","v":"Bằng chữ:  đồng./."}]
[null,null,"NGƯỜI LẬP",null,"NGƯỜI CHỦ TRÌ"]
[]
[]
[null,null,null,null,"Chứng chỉ hành nghề định giá XD hạng….., số…………"]
[]
[]
[]
[]
[null,null,null,null,null,null,null,"F"]
[]
[null,"TỔNG HỢP DỰ TOÁN CHI PHÍ XÂY DỰNG"]
[null,{"$f":"Info!$C$5&Info!$D$5","v":"Dự án: Dự án đầu tư xây dựng công trình …"}]
[null,{"$f":"Info!$C$6&Info!$D$6","v":"Công trình: Công trình xây dựng …"}]
[null,"HẠNG MỤC/WORK ITEM : ...",null,null,null,null,null,"FORM1-TT06"]
[null,null,null,null,null,null,null,"TT06"]
[null,"STT","NỘI DUNG CHI PHÍ","CÁCH TÍNH","GIÁ TRỊ","KÝ HIỆU","HỆ SỐ"]
[null,"I","CHI PHÍ TRỰC TIẾP"]
[null,1,"Chi phí vật liệu","VL",{"$f":"IF(MoEs<>4,E287,E285)","v":0},"VL"]
[null,null,"Chi phí vật liệu gốc","Bảng dự toán khối lượng",null,"VLg"]
[null,null,"Chênh lệch giá vật liệu","Bảng tổng hợp vật tư",null,"CLVL"]
[null,null,"Điều chỉnh hệ số","(VLg+CLVL)*Kvl",{"$f":"IF(OR(MoEs=2,MoEs=3),(E285+E286)*G287,0)","v":0},"Hvl",{"$f":"Info!$D$20","v":1}]
[null,2,"Chi phí nhân công","NC",{"$f":"IF(MoEs<>4,E291,E289)","v":25646555},"NC"]
[null,null,"Chi phí nhân công gốc","Bảng dự toán khối lượng",25646555,"NCg"]
[null,null,"Chênh lệch giá nhân công","Bảng tổng hợp vật tư",null,"CLNC"]
[null,null,"Điều chỉnh hệ số","(NCg+CLNC)*Knc",{"$f":"IF(OR(MoEs=2,MoEs=3),(E289+E290)*G291,0)","v":0},"Hnc",{"$f":"Info!$D$21","v":1}]
[null,3,"Chi phí máy thi công","M",{"$f":"IF(MoEs<>4,E295,E293)","v":0},"M"]
[null,null,"Chi phí máy thi công gốc","Bảng dự toán khối lượng",null,"Mg"]
[null,null,"Chênh lệch giá máy thi công","Bảng tổng hợp vật tư",null,"CLM"]
[null,null,"Điều chỉnh hệ số","(Mg+CLM)*Kmtc",{"$f":"IF(OR(MoEs=2,MoEs=3),(E293+E294)*G295,0)","v":0},"Hm",{"$f":"Info!$D$22","v":1}]
["S",null,"Chi phí trực tiếp","VL + NC + M",{"$f":"E284+E288+E292","v":25646555},"T",null,"Mẫu Dự thầu HĐ trọn gói"]
[null,"II","CHI PHÍ CHUNG",{"$f":"IF(Info!$C$23=\"Định mức chi phí chung tính trên chi phí trực tiếp (C)\",\"T x \"&ROUND(G297*100,3)&\"%\",IF(Info!$C$23=\"Định mức chi phí chung tính trên chi phí nhân công (C)\",\"NC x \"&ROUND(G297*100,3)&\"%\"))","v":"T x 7,3%"},{"$f":"IF(Info!$C$23=\"Định mức chi phí chung tính trên chi phí trực tiếp (C)\",E296*G297,IF(Info!$C$23=\"Định mức chi phí chung tính trên chi phí nhân công (C)\",E288*G297))","v":1872198.5149999999},"C",{"$f":"Info!$D$23","v":7.2999999999999995E-2}]
[null,"III","THU NHẬP CHỊU THUẾ TÍNH TRƯỚC",{"$f":"\"(T + C) x \"&G298*100&\"%\"","v":"(T + C) x 5,5%"},{"$f":"(E296+E297)*G298","v":1513531.4433250001},"TL",{"$f":"Info!$D$24","v":5.5E-2}]
[null,null,"Chi phí xây dựng trước thuế","T + C + TL",{"$f":"E296+E297+E298","v":29032284.958325002},"G"]
[null,"IV","THUẾ GIÁ TRỊ GIA TĂNG",{"$f":"\"G x \"&ROUND(G300*100,3)&\"%\"","v":"G x 10%"},{"$f":"E299*G300","v":2903228.4958325005},"GTGT",{"$f":"Info!$D$25","v":0.1}]
[null,null,"Đơn giá xây dựng sau thuế","G + GTGT",{"$f":"E300+E299","v":31935513.454157501},"Gst"]
[null,null,"Chi phí dự phòng khối lượng phát sinh",{"$f":"\"Gst x \"&ROUND(G302*100,3)&\"%\"","v":"Gst x 5%"},{"$f":"E301*G302","v":1596775.6727078753},"Gdp1",{"$f":"Info!$D$28","v":0.05}]
[null,null,"Chi phí dự phòng trượt giá",{"$f":"\"Gst x \"&ROUND(G303*100,3)&\"%\"","v":"Gst x 8%"},{"$f":"E301*G303","v":2554841.0763326003},"Gdp2",{"$f":"Info!$D$29","v":0.08}]
[null,null,"Đơn giá dự thầu","Gst + Gdp1 + Gdp2",{"$f":"E301+E302+E303","v":36087130.203197978},"Gdt"]
[null,null,"Làm tròn"," ",{"$f":"ROUND(E304,-3)","v":36087000}]
[null,{"$f":"\"Bằng chữ: \"&doc_vnd(E305)&\"/.\"","v":"Bằng chữ: Ba mươi sáu triệu không trăm tám mươi bảy nghìn đồng./."}]
[null,null,"NGƯỜI LẬP",null,"NGƯỜI CHỦ TRÌ"]
[]
[]
[null,null,null,null,"Chứng chỉ hành nghề định giá XD hạng….., số…………"]
[]
[]
[]
[]
[null,null,null,null,null,null,null,"F"]

{"sheet":"CP HMC","index":12,"n_rows":28,"n_cols":9,"rows_kept":28,"cut":false,"hidden":true,"merged":[]}
[null,"CHI PHÍ HẠNG MỤC CHUNG"]
[null,{"$f":"Info!$C$5&Info!$D$5","v":"Dự án: Dự án đầu tư xây dựng công trình …"}]
[null,{"$f":"Info!$C$6&Info!$D$6","v":"Công trình: Công trình xây dựng …"}]
[null,"CHI PHÍ HẠNG MỤC CHUNG PHẦN XÂY DỰNG"]
[null,null,null,null,null,null,null,"ĐVT: đồng"]
[null,"STT","NỘI DUNG CHI PHÍ","ĐMTL","CÁCH TÍNH","CHI PHÍ\nTRƯỚC THUẾ","THUẾ GTGT","CHI PHÍ SAU THUẾ","KÝ HIỆU"]
[null,1,"Chi phí xây dựng nhà tạm tại hiện trường để ở và điều hành thi công",{"$f":"Info!$D$26","v":1.1000000000000001E-2},"ĐMTL*GXD",{"$f":"'Dự toán XDCT'!$G$14*'CP HMC'!D7","v":0},{"$f":"F7*0.1","v":0},{"$f":"SUM(F7:G7)","v":0},"CNT"]
[null,2,"Chi phí một số công tác không xác định được khối lượng từ thiết kế",{"$f":"Info!$D$27","v":2.5000000000000001E-2},"ĐMTL*GXD",{"$f":"'Dự toán XDCT'!$G$14*'CP HMC'!D8","v":0},{"$f":"F8*0.1","v":0},{"$f":"SUM(F8:G8)","v":0},"CKKL"]
[null,3,"Các chi phí hạng mục chung khác",null,null,{"$f":"SUM(F10:F12)","v":0},{"$f":"SUM(G10:G12)","v":0},0,"CK"]
[null,"3.1","Chi phí di chuyển thiết bị thi công và lực lượng lao động đến công trường",null,"Lập dự toán"]
[null,"3.2","Chi phí đảm bảo an toàn giao thông phục vụ thi công",null,"Lập dự toán"]
[null,"3.3","Chi phí hoàn trả hạ tầng kỹ thuật do bị ảnh hưởng khi thi công xây dựng công trình",null,"Lập dự toán"]
[null,"…","…"]
[null,null,"Tổng cộng:",null,null,{"$f":"SUM(F7:F8)","v":0},{"$f":"SUM(G7:G9)","v":0},0,"CHMCtcxd"]
[]
[]
[]
[null,"CHI PHÍ HẠNG MỤC CHUNG PHẦN LẮP ĐẶT THIẾT BỊ"]
[null,null,null,null,null,null,null,"ĐVT: đồng"]
[null,"STT","NỘI DUNG CHI PHÍ","ĐMTL","CÁCH TÍNH","CHI PHÍ\nTRƯỚC THUẾ","THUẾ GTGT","CHI PHÍ SAU THUẾ","KÝ HIỆU"]
[null,1,"Chi phí xây dựng nhà tạm tại hiện trường để ở và điều hành thi công lắp đặt thiết bị",{"$f":"Info!$D$26","v":1.1000000000000001E-2},"ĐMTL*GLD",0,0,0,"CNT"]
[null,2,"Chi phí một số công tác không xác định được khối lượng từ thiết kế lắp đặt thiết bị",{"$f":"Info!$D$27","v":2.5000000000000001E-2},"ĐMTL*GLD",0,0,0,"CKKL"]
[null,3,"Các chi phí hạng mục chung khác",null,null,{"$f":"SUM(F24:F26)","v":0},{"$f":"SUM(G24:G26)","v":0},{"$f":"SUM(H24:H26)","v":0},"CK"]
[null,"3.1","Chi phí di chuyển thiết bị thi công và lực lượng lao động đến công trường",null,"Lập dự toán"]
[null,"3.2","Chi phí đảm bảo an toàn giao thông phục vụ thi công",null,"Lập dự toán"]
[null,"3.3","Chi phí hoàn trả hạ tầng kỹ thuật do bị ảnh hưởng khi thi công xây dựng công trình",null,"Lập dự toán"]
[null,"…","…"]
[null,null,"Tổng cộng:",null,null,{"$f":"SUM(F21:F22)","v":0},{"$f":"SUM(G21:G23)","v":0},0,"CHMClđtb"]

{"sheet":"CP Chuyên gia","index":13,"n_rows":13,"n_cols":8,"rows_kept":13,"cut":false,"hidden":true,"merged":[]}
[null,"TỔNG CHI PHÍ CHUYÊN GIA"]
[null,{"$f":"Info!$C$5&Info!$D$5","v":"Dự án: Dự án đầu tư xây dựng công trình …"}]
[null,{"$f":"Info!$C$6&Info!$D$6","v":"Công trình: Công trình xây dựng …"}]
[null,"GÓI THẦU: TƯ VẤN GIÁM SÁT"]
[null,null,null,null,null,null,null,"Đơn vị: đồng"]
[null,"STT","MÃ CG","HỌ, TÊN CHUYÊN GIA","NHIỆM VỤ ĐƯỢC PHÂN CÔNG","THỜI GIAN THỰC HIỆN","CHI PHÍ \nNGÀY CÔNG","THÀNH TIỀN"]
[null,{"$f":"IF(tbl_CPCG[[#This Row],[MÃ CG]]<>0,COUNT($B$6:B6)+1,\"\")","v":1},"CG1","Nguyễn Văn A","Chuyên gia",50,null,{"$f":"IF(tbl_CPCG[[#This Row],[THỜI GIAN THỰC HIỆN]]<>0,tbl_CPCG[[#This Row],[THỜI GIAN THỰC HIỆN]]*tbl_CPCG[[#This Row],[CHI PHÍ \nNGÀY CÔNG]],\"\")","v":0}]
[null,{"$f":"IF(tbl_CPCG[[#This Row],[MÃ CG]]<>0,COUNT($B$6:B7)+1,\"\")","v":2},"CG2","Nguyễn Văn B","Chuyên gia",30,null,{"$f":"IF(tbl_CPCG[[#This Row],[THỜI GIAN THỰC HIỆN]]<>0,tbl_CPCG[[#This Row],[THỜI GIAN THỰC HIỆN]]*tbl_CPCG[[#This Row],[CHI PHÍ \nNGÀY CÔNG]],\"\")","v":0}]
[null,{"$f":"IF(tbl_CPCG[[#This Row],[MÃ CG]]<>0,COUNT($B$6:B8)+1,\"\")","v":3},"CG3","Nguyễn Văn C","Chuyên gia",3,null,{"$f":"IF(tbl_CPCG[[#This Row],[THỜI GIAN THỰC HIỆN]]<>0,tbl_CPCG[[#This Row],[THỜI GIAN THỰC HIỆN]]*tbl_CPCG[[#This Row],[CHI PHÍ \nNGÀY CÔNG]],\"\")","v":0}]
[null,{"$f":"IF(tbl_CPCG[[#This Row],[MÃ CG]]<>0,COUNT($B$6:B9)+1,\"\")","v":4},"CG4","Nguyễn Văn D","Chuyên gia",2,null,{"$f":"IF(tbl_CPCG[[#This Row],[THỜI GIAN THỰC HIỆN]]<>0,tbl_CPCG[[#This Row],[THỜI GIAN THỰC HIỆN]]*tbl_CPCG[[#This Row],[CHI PHÍ \nNGÀY CÔNG]],\"\")","v":0}]
[null,{"$f":"IF(tbl_CPCG[[#This Row],[MÃ CG]]<>0,COUNT($B$6:B10)+1,\"\")","v":5},"CG5","Nguyễn Văn E","Chuyên gia",2,null,{"$f":"IF(tbl_CPCG[[#This Row],[THỜI GIAN THỰC HIỆN]]<>0,tbl_CPCG[[#This Row],[THỜI GIAN THỰC HIỆN]]*tbl_CPCG[[#This Row],[CHI PHÍ \nNGÀY CÔNG]],\"\")","v":0}]
[null,{"$f":"IF(tbl_CPCG[[#This Row],[MÃ CG]]<>0,COUNT($B$6:B11)+1,\"\")","v":6},"CG6","Nguyễn Văn F","Chuyên gia",30,null,{"$f":"IF(tbl_CPCG[[#This Row],[THỜI GIAN THỰC HIỆN]]<>0,tbl_CPCG[[#This Row],[THỜI GIAN THỰC HIỆN]]*tbl_CPCG[[#This Row],[CHI PHÍ \nNGÀY CÔNG]],\"\")","v":0}]
[null,null,null,null,null,null,"Tổng",{"$f":"SUBTOTAL(109,tbl_CPCG[THÀNH TIỀN])","v":0}]

{"sheet":"CP Tư vấn khác","index":14,"n_rows":24,"n_cols":7,"rows_kept":24,"cut":false,"hidden":true,"merged":[]}
[null,"CHI PHÍ TƯ VẤN KHÁC"]
[null,{"$f":"Info!$C$5&Info!$D$5","v":"Dự án: Dự án đầu tư xây dựng công trình …"}]
[null,{"$f":"Info!$C$6&Info!$D$6","v":"Công trình: Công trình xây dựng …"}]
[null,"GÓI THẦU: TƯ VẤN GIÁM SÁT"]
[null,null,null,null,null,null,"Đơn vị: đồng"]
[null,"STT","KHOẢN MỤC CHI PHÍ","ĐƠN VỊ","KHỐI LƯỢNG","ĐƠN GIÁ","THÀNH TIỀN"]
[null,1,"Khấu hao máy móc thiết bị văn phòng"]
[null,null," - Máy tính + phần mềm bản quyền","ca",50,200000,{"$f":"tbl_TVkhac[[#This Row],[KHỐI LƯỢNG]]*tbl_TVkhac[[#This Row],[ĐƠN GIÁ]]","v":10000000}]
[null,null," - Máy in","ca",10,150000,{"$f":"tbl_TVkhac[[#This Row],[KHỐI LƯỢNG]]*tbl_TVkhac[[#This Row],[ĐƠN GIÁ]]","v":1500000}]
[null,null," - Máy photocopy","ca",5,300000,{"$f":"tbl_TVkhac[[#This Row],[KHỐI LƯỢNG]]*tbl_TVkhac[[#This Row],[ĐƠN GIÁ]]","v":1500000}]
[null,null," - Máy chiếu","ca",10,500000,{"$f":"tbl_TVkhac[[#This Row],[KHỐI LƯỢNG]]*tbl_TVkhac[[#This Row],[ĐƠN GIÁ]]","v":5000000}]
[null,2,"Văn phòng phẩm"]
[null,null," - Giấy","Gram",120,70000,{"$f":"tbl_TVkhac[[#This Row],[KHỐI LƯỢNG]]*tbl_TVkhac[[#This Row],[ĐƠN GIÁ]]","v":8400000}]
[null,null," - Mực in","Hộp",5,80000,{"$f":"tbl_TVkhac[[#This Row],[KHỐI LƯỢNG]]*tbl_TVkhac[[#This Row],[ĐƠN GIÁ]]","v":400000}]
[null,null," - Văn phòng phẩm khác (bút, dụng cụ đóng tập…)","Tb",1,1000000,{"$f":"tbl_TVkhac[[#This Row],[KHỐI LƯỢNG]]*tbl_TVkhac[[#This Row],[ĐƠN GIÁ]]","v":1000000}]
[null,3,"Chi phí đi lại",null,null,null,10000000]
[null,null," - Chi phí đi khảo sát hiện trường","lần",5,2000000,{"$f":"tbl_TVkhac[[#This Row],[KHỐI LƯỢNG]]*tbl_TVkhac[[#This Row],[ĐƠN GIÁ]]","v":10000000}]
[null,4,"Chi phí hội họp, phản biện","lần",5,4000000,{"$f":"tbl_TVkhac[[#This Row],[KHỐI LƯỢNG]]*tbl_TVkhac[[#This Row],[ĐƠN GIÁ]]","v":20000000}]
[null,5,"Chi phí quản lý, dịch vụ khác",null,null,null,50000000]
[null,null,"- Điện thoại","Thuê bao",5,500000,{"$f":"tbl_TVkhac[[#This Row],[KHỐI LƯỢNG]]*tbl_TVkhac[[#This Row],[ĐƠN GIÁ]]","v":2500000}]
[null,null,"- Internet","Tb",1,1500000,{"$f":"tbl_TVkhac[[#This Row],[KHỐI LƯỢNG]]*tbl_TVkhac[[#This Row],[ĐƠN GIÁ]]","v":1500000}]
[null,null,"- Điện, nước văn phòng","Tb",1,5000000,{"$f":"tbl_TVkhac[[#This Row],[KHỐI LƯỢNG]]*tbl_TVkhac[[#This Row],[ĐƠN GIÁ]]","v":5000000}]
[null,null,null,null,null,null,{"$f":"tbl_TVkhac[[#This Row],[KHỐI LƯỢNG]]*tbl_TVkhac[[#This Row],[ĐƠN GIÁ]]","v":0}]
[null,null,null,null,null,null,{"$f":"SUBTOTAL(109,tbl_TVkhac[THÀNH TIỀN])","v":126800000}]

{"sheet":"THKL","index":15,"n_rows":31,"n_cols":19,"rows_kept":31,"cut":false,"hidden":true,"merged":[[5,8,6,8],[5,7,6,7],[5,9,6,9],[5,18,6,18],[5,17,6,17],[5,6,6,6],[5,1,6,1],[5,2,6,2],[5,3,6,3],[5,4,6,4],[5,5,6,5]]}
[null,"BẢNG TỔNG HỢP KHỐI LƯỢNG CÔNG TÁC XÂY DỰNG"]
[null,{"$f":"\"Tên dự án: \"&Info!$D$5","v":"Tên dự án: Dự án đầu tư xây dựng công trình …"}]
[null,{"$f":"\"Tên công trình: \"&Info!$D$6","v":"Tên công trình: Công trình xây dựng …"}]
[null,"Hạng mục công trình: "]
[]
[null,"Stt","ShHM","Số hiệu","Mã hiệu\ncông tác","Mã hiệu định mức","Danh mục công tác xây dựng","Đơn vị","Cách thức xác định","Khối lượng","Khối lượng",null,null,null,null,null,null,"Ghi chú","Mã tập đơn giá"]
[null,null,null,null,null,null,null,null,null,null,"Số lượng","Dài","Rộng","Cao","Hệ số","S-phụ","Tổng kl"]
[null,0,2,"[2]▼","[2]▼","[3']",3,4,5,6,null,null,null,null,null,null,null,7]
[{"$f":"IF(AND(E9<>\"\",F9<>\"\"),COUNT($A$8:A8)+1,\"\")","v":""}]
[{"$f":"IF(AND(E10<>\"\",F10<>\"\"),COUNT($A$8:A9)+1,\"\")","v":""}]
[]
[]
[]
[]
[]
[]
[]
[]
[]
[]
[]
[]
[]
[]
[]
[null,null,null,null,null,null,"Người thực hiện",null,"Người chủ trì"]
[]
[]
[]
[null,null,null,null,null,null,null,null,"Chứng chỉ hành nghề hoạt động xây dựng Số…"]
[null,null,null,null,null,null,null,null,"Lĩnh vực hành nghề: Định giá xây dựng hạng …"]

{"sheet":"CTKL","index":16,"n_rows":32,"n_cols":11,"rows_kept":32,"cut":false,"hidden":true,"merged":[[5,7,6,7],[5,9,6,9],[5,10,6,10],[5,6,6,6],[5,8,6,8],[5,1,6,1],[5,2,6,2],[5,3,6,3],[5,4,6,4],[5,5,6,5]]}
[null,"BẢNG CHI TIẾT KHỐI LƯỢNG CÔNG TÁC XÂY DỰNG"]
[null,{"$f":"\"Tên dự án: \"&Info!$D$5","v":"Tên dự án: Dự án đầu tư xây dựng công trình …"}]
[null,{"$f":"\"Tên công trình: \"&Info!$D$6","v":"Tên công trình: Công trình xây dựng …"}]
[null,"Hạng mục công trình: "]
[]
[null,"Stt","Ký hiệu bản vẽ","Mã hiệu\ncông tác","Danh mục công tác xây dựng","Đơn vị","Số bộ phận giống nhau","Diễn giải tính toán","Khối lượng một bộ phận","Khối lượng toàn bộ phận","Ghi chú"]
[]
[null,0,2,"[2]▼",3,4,null,5,6,6,7]
[]
[]
[]
[]
[]
[]
[]
[]
[]
[]
[]
[]
[]
[]
[]
[]
[]
[null,null,null,null,"Người thực hiện",null,null,"Người chủ trì"]
[]
[]
[]
[null,null,null,null,null,null,null,"Chứng chỉ hành nghề hoạt động xây dựng"]
[null,null,null,null,null,null,null,"Số..."]
[null,null,null,null,null,null,null,"Lĩnh vực hành nghề: Định giá xây dựng hạng …"]

{"sheet":"CP Dự phòng","index":17,"n_rows":34,"n_cols":12,"rows_kept":34,"cut":false,"hidden":true,"merged":[[26,1,27,1],[26,2,27,2],[18,1,18,6],[19,1,19,6],[20,1,20,6]]}
[null,"BẢNG TÍNH CHI PHÍ DỰ PHÒNG"]
[null,null,null,"GXDCT = (GXD + GTB + GQLDA + GTV + GK) =",{"$f":"'Dự toán XDCT'!I14+'Dự toán XDCT'!I17+'Dự toán XDCT'!I19+'Dự toán XDCT'!I21+'Dự toán XDCT'!I25","v":0},"đồng"]
[null,"I. Chi phí dự phòng cho yếu tố khối lượng công việc phát sinh",null,null,null,null,null,null,null,"Số năm (hoặc quý, tháng) lấy chỉ số giá: ",3,"Năm"]
[null,null,null,"GDP1 = GXDCT x kps = (GXD+GTB+GQLDA+GTV+GK) x kps =",{"$f":"$E$2*G4","v":0},"đồng",0.05,null,null,"Thời điểm lấy chỉ số giá đầu tiên",{"$f":"L3","v":"Năm"},2019]
[null," - kps là hệ số dự phòng cho khối lượng công việc phát sinh",null,null,null,null,null,null,null,"Số năm (hoặc quý, tháng) thực hiện dự án dự kiến:",4,"Năm"]
[null,"II. Chi phí dự phòng cho yếu tố trượt giá",null,null,null,null,null,null,null,"Thời điểm bắt đầu thực hiện",{"$f":"L5","v":"Năm"},2023]
[null,"STT","Nội dung","Các chỉ số"]
[null,1,"Các năm cơ sở lấy chỉ số giá",{"$f":"L4","v":2019},{"$f":"D8+1","v":2020},{"$f":"E8+1","v":2021},2022,null,null,"Kps phụ thuộc vào mức độ phức tạp của công trình thuộc dự án và điều kiện địa chất công trình nơi xây dựng công trình"]
[null,2,"Chỉ số giá xây dựng do Cơ quan có thẩm quyền công bố",1.02,1.03,1.0349999999999999,1.0249999999999999,null,null,"Trong bước lập TMĐT Kps ≤ 10%."]
[null,3,"Chỉ số năm sau chia chỉ số năm trước",null,{"$f":"E9/D9","v":1.0098039215686274},{"$f":"F9/E9","v":1.0048543689320388},{"$f":"G9/F9","v":0.99033816425120769},null,null,"Trong bước lập dự toán Kps ≤ 5%."]
[null,4,"Chỉ số giá xây dựng sử dụng tính dự phòng cho yếu tố trượt giá: IXDCTbq",null,null,null,{"$f":"AVERAGE(E10:G10)","v":1.0016654849172912}]
[null,5,"Mức biến động bình quân của chỉ số giá xây dựng: ±∆IXDCT (nếu có)"]
[]
[null,"Công thức xác định"]
[]
[null,"Trong đó:"]
[null,"- T: thời gian xây dựng công trình xác định theo (quý, năm);"]
[null,"- t: số thứ tự thời gian phân bổ vốn theo kế hoạch xây dựng công trình (t=1, T);"]
[null,"- GtXDCT: giá trị dự toán xây dựng công trình trước chi phí dự phòng thực hiện trong khoảng thời gian thứ t;"]
[null,"- IXDCTbq: Chỉ số giá xây dựng sử dụng tính dự pḥòng cho yếu tố trượt giá"]
[null,"- ±∆IXDCT: mức biến động bình quân của chỉ số giá xây dựng theo thời gian dựng công trình so với mức độ trượt giá bình quân của đơn vị thời gian (quý, năm) đã tính và được xác định trên cơ sở dự báo xu hướng biến động của các yếu tố chi phí giá cả trong khu vực và quốc tế bằng kinh nghiệm chuyên gia."]
[null,null,null,"Trong đó:"]
[null,null,null,"T: Số năm (năm gần nhất so với thời điểm tính toán sử dụng để xác định IXDCTbq); T≥3;"]
[null,null,null,"In: Chỉ số giá xây dựng năm thứ n được lựa chọn;"]
[null,null,null,"In+1: Chỉ số giá xây dựng năm thứ n+1; "]
[]
[null,"STT","Nội dung","Tiến độ thực hiện dự án"]
[null,null,null,{"$f":"L6","v":2023},{"$f":"D28+1","v":2024},{"$f":"E28+1","v":2025},2026]
[null,1,"Tỷ lệ phân bổ chi phí theo tiến độ",0.1,0.2,0.3,{"$f":"100%-SUM(D29:F29)","v":0.39999999999999991}]
[null,2,"Chi phí thực hiện chưa tính trượt giá",{"$f":"D29*$E$2","v":0},{"$f":"E29*$E$2","v":0},{"$f":"F29*$E$2","v":0},{"$f":"G29*$E$2","v":0}]
[null,3,"Trượt giá từng năm",{"$f":"D30*(($G$11+$G$12)^COUNT($D$30:D30)-1)","v":0},{"$f":"E30*(($G$11+$G$12)^COUNT($D$30:E30)-1)","v":0},{"$f":"F30*(($G$11+$G$12)^COUNT($D$30:F30)-1)","v":0},{"$f":"G30*(($G$11+$G$12)^COUNT($D$30:G30)-1)","v":0}]
[null,4,"Chi phí dự phòng do yếu tố trượt giá ",null,null,null,{"$f":"SUM(D31:G31)","v":0}]
[]
[null,null,"Tổng Chi phí dự phòng:",null,"GDP = GDP1 + GDP2 = ",{"$f":"E4+G32","v":0},"đồng"]

{"sheet":"Tổng hợp CPXD","index":18,"n_rows":42,"n_cols":8,"rows_kept":42,"cut":false,"hidden":false,"merged":[]}
[null,"BẢNG TỔNG HỢP DỰ TOÁN CHI PHÍ XÂY DỰNG",null,null,null,null,null,"HM0"]
[null,{"$f":"\"Dự án: \"&Info!$D$5","v":"Dự án: Dự án đầu tư xây dựng công trình …"}]
[null,{"$f":"\"Công trình: \"&Info!$D$6","v":"Công trình: Công trình xây dựng …"}]
[null,null,null,null,null,"Đơn vị tính: đồng"]
[]
[null,"STT","NỘI DUNG CHI PHÍ","CÁCH TÍNH","GIÁ TRỊ","KÝ HIỆU","Hệ số"]
[null,"I","CHI PHÍ TRỰC TIẾP"]
[null,1,"Chi phí vật liệu","VL",{"$f":"'Dự toán'!$U$24+'Dự toán'!$V$24","v":0},"VL"]
[null,null,{"$f":"IF(MoEs<>4,\"Chi phí vật liệu gốc\",\"Chi phí vật liệu trực tiếp\")","v":"Chi phí vật liệu trực tiếp"},"Bảng dự toán khối lượng",{"$f":"'Dự toán'!$U$24+'Dự toán'!$V$24","v":0},"VLg"]
[null,null,"Chênh lệch giá vật liệu","Bảng tổng hợp vật tư",null,"CLVL"]
[null,null,"Điều chỉnh hệ số","(VLg+CLVL)*Kvl",null,"Hvl",{"$f":"Info!$D$20","v":1}]
[null,2,"Chi phí nhân công","NC",{"$f":"'Dự toán'!$W$24","v":0},"NC"]
[null,null,{"$f":"IF(MoEs<>4,\"Chi phí nhân công gốc\",\"Chi phí nhân công trực tiếp\")","v":"Chi phí nhân công trực tiếp"},"Bảng dự toán khối lượng",{"$f":"'Dự toán'!$W$24","v":0},"NCg"]
[null,null,"Chênh lệch giá nhân công","Bảng tổng hợp vật tư",null,"CLNC"]
[null,null,"Điều chỉnh hệ số","(NCg+CLNC)*Knc",null,"Hnc",{"$f":"Info!$D$21","v":1}]
[null,3,"Chi phí máy và thiết bị thi công","M",{"$f":"'Dự toán'!$X$24","v":0},"M"]
[null,null,{"$f":"IF(MoEs<>4,\"Chi phí máy thi công gốc\",\"Chi phí máy thi công trực tiếp\")","v":"Chi phí máy thi công trực tiếp"},"Bảng dự toán khối lượng",{"$f":"'Dự toán'!$X$24","v":0},"Mg"]
[null,null,"Chênh lệch giá máy thi công","Bảng tổng hợp vật tư",null,"CLM"]
[null,null,"Điều chỉnh hệ số","(Mg+CLM)*Kmtc",null,"Hm",{"$f":"Info!$D$22","v":1}]
["S",null,"Chi phí trực tiếp","VL + NC + M",{"$f":"E8+E12+E16","v":0},"T",null,"Chi phí Xây dựng | Phụ lục số 3 Thông tư 11/2021/TT-BXD"]
[null,"II","CHI PHÍ GIÁN TIẾP",null,null,"_"]
[null,1,"Chi phí chung",{"$f":"IF(Info!$C$23=\"Định mức chi phí chung tính trên chi phí trực tiếp (C)\",\"T x \"&ROUND(G22*100,3)&\"%\",IF(Info!$C$23=\"Định mức chi phí chung tính trên chi phí nhân công (C)\",\"NC x \"&ROUND(G22*100,3)&\"%\"))","v":"T x 7,3%"},{"$f":"IF(Info!$C$23=\"Định mức chi phí chung tính trên chi phí trực tiếp (C)\",E20*G22,IF(Info!$C$23=\"Định mức chi phí chung tính trên chi phí nhân công (C)\",E12*G22))","v":0},"C",{"$f":"Info!$D$23","v":7.2999999999999995E-2}]
[null,2,"Chi phí nhà tạm để ở và điều hành thi công",{"$f":"\"T x \"&ROUND(G23*100,3)&\"%\"","v":"T x 1,1%"},{"$f":"E20*G23","v":0},"LT",{"$f":"Info!$D$26","v":1.1000000000000001E-2}]
[null,3,"Chi phí một số công việc không xác định được khối lượng từ thiết kế",{"$f":"\"T x \"&ROUND(G24*100,3)&\"%\"","v":"T x 2,5%"},{"$f":"E20*G24","v":0},"TT",{"$f":"Info!$D$27","v":2.5000000000000001E-2}]
[null,null,"Chi phí gián tiếp","C + LT + TT",{"$f":"E22+E23+E24","v":0},"GT"]
[null,"III","THU NHẬP CHỊU THUẾ TÍNH TRƯỚC",{"$f":"\"(T + GT) x \"&G26*100&\"%\"","v":"(T + GT) x 5,5%"},{"$f":"(E20+E25)*G26","v":0},"TL",{"$f":"Info!$D$24","v":5.5E-2}]
[null,null,"Chi phí xây dựng trước thuế","T + GT + TL",{"$f":"E20+E25+E26","v":0},"G"]
[null,"IV","THUẾ GIÁ TRỊ GIA TĂNG",{"$f":"\"G x \"&ROUND(G28*100,3)&\"%\"","v":"G x 10%"},{"$f":"E27*G28","v":0},"GTGT",{"$f":"Info!$D$25","v":0.1}]
[null,null,"Chi phí xây dựng sau thuế","G + GTGT",{"$f":"E28+E27","v":0},"GXD"]
[null,null,"Làm tròn"," ",{"$f":"ROUND(E29,-3)","v":0}]
[null,{"$f":"\"Bằng chữ: \"&doc_vnd(E30)&\"/.\"","v":"Bằng chữ:  đồng./."}]
[]
[null,null,"NGƯỜI LẬP",null,"NGƯỜI CHỦ TRÌ"]
[]
[]
[]
[]
[]
[null,null,null,null,"Chứng chỉ hành nghề định giá XD hạng….., số…………"]
[]
[]
[null,null,null,null,null,null,null,"F"]

{"sheet":"Dự toán","index":19,"n_rows":27,"n_cols":28,"rows_kept":27,"cut":false,"hidden":false,"merged":[[5,24,6,24],[5,25,6,25],[5,27,6,27],[5,1,6,1],[5,4,6,4],[5,6,6,6],[5,7,6,7],[5,8,6,8],[5,5,6,5],[5,26,6,26],[5,3,6,3],[5,2,6,2]]}
[null,"BẢNG DỰ TOÁN - KHỐI LƯỢNG"]
[null,{"$f":"\"Dự án: \"&Info!$D$5","v":"Dự án: Dự án đầu tư xây dựng công trình …"}]
[null,{"$f":"\"Công trình: \"&Info!$D$6","v":"Công trình: Công trình xây dựng …"}]
[null,{"$f":"\"Tên gói thầu: \"&Info!$D$7","v":"Tên gói thầu: Thi công xây lắp …"}]
[]
[null,"STT","ShHM","Số hiệu","Mã hiệu\nĐơn giá","Mã hiệu định mức","Nội dung công việc","Đơn vị","Khối lượng","Khối lượng",null,null,null,null,null,null,"Đơn giá",null,null,null,"Thành tiền",null,null,null,"Đơn giá","Thành tiền","Mã tập đơn giá","Ghi chú"]
[null,null,null,null,null,null,null,null,null,"Số lượng","Dài","Rộng","Cao","Hệ số","S-phụ","Tổng kl","Vật liệu","Vl phụ","Nhân công","Máy","Vật liệu","Vl phụ","Nhân công","Máy"]
[null,0,2,"[2]▼","[2]▼","[3']",3,4,5,{"$f":"IF(Options!$E$14=1,H8+1,0)","v":0},{"$f":"IF(Options!$E$14=1,J8+1,0)","v":0},{"$f":"IF(Options!$E$14=1,K8+1,0)","v":0},{"$f":"IF(Options!$E$14=1,L8+1,0)","v":0},{"$f":"IF(Options!$E$14=1,M8+1,0)","v":0},{"$f":"IF(Options!$E$14=1,N8+1,0)","v":0},{"$f":"IF(Options!$E$14=1,O8+1,0)","v":0},6,{"$f":"COUNTIF($B$8:Q8,\">0\")+1","v":6},7,{"$f":"COUNTIF($B$8:S8,\">0\")+1","v":8},{"$f":"COUNTIF($B$8:T8,\">0\")+1","v":9},{"$f":"COUNTIF($B$8:U8,\">0\")+1","v":10},10,11,6,7,null,12]
[{"$f":"IF(AND(E9<>\"\",F9<>\"\"),COUNT($A$8:A8)+1,\"\")","v":""}]
[{"$f":"IF(AND(E10<>\"\",F10<>\"\"),COUNT($A$8:A9)+1,\"\")","v":""}]
[]
[]
[]
[]
[]
[]
[]
[]
[]
[]
[]
[]
[]
[null,null,null,null,null,null,"TỔNG CỘNG",null,null,null,null,null,null,null,null,null,null,null,null,null,{"$f":"SUM(U$9:U$23)","v":0},{"$f":"SUM(V$9:V$23)","v":0},{"$f":"SUM(W$9:W$23)","v":0},{"$f":"SUM(X$9:X$23)","v":0},null,{"$f":"SUM(Z$9:Z$21)","v":0}]
[null,null,null,null,null,null,"LÀM TRÒN",null,null,null,null,null,null,null,null,null,null,null,null,null,{"$f":"ROUND(U24,-3)","v":0},{"$f":"ROUND(V24,3)","v":0},{"$f":"ROUND(W24,-3)","v":0},{"$f":"ROUND(X24,-3)","v":0},null,{"$f":"ROUND(Z24,3)","v":0}]
[]
[null,"KHÔNG XÓA",null,null,null,"DO NOT REMOVE",null,"KHÔNG XÓA",null,null,null,null,null,null,null,null,"DO NOT REMOVE",null,null,"KHÔNG XÓA","DO NOT REMOVE",null,null,"KHÔNG XÓA"]

{"sheet":"Draff","index":20,"n_rows":0,"n_cols":0,"rows_kept":0,"cut":false,"hidden":true,"merged":[]}

{"sheet":"Đơn giá","index":21,"n_rows":14,"n_cols":24,"rows_kept":14,"cut":false,"hidden":false,"merged":[[5,10,6,10],[5,11,6,11],[5,2,6,2],[5,23,6,23],[5,22,6,22],[5,12,6,12],[5,14,6,14],[5,21,6,21],[5,13,6,13],[5,1,6,1],[5,4,6,4],[5,5,6,5],[5,8,6,8],[5,9,6,9],[5,6,6,6],[5,3,6,3],[5,7,6,7]]}
[null,"BẢNG ĐƠN GIÁ CHI TIẾT",null,null,null,null,null,null,null,null,null,null,null,null,null," ",null,null,null," "," ",null," "," "]
[null,{"$f":"Info!$C$5&Info!$D$5","v":"Dự án: Dự án đầu tư xây dựng công trình …"},null,null,null,null,null,null,null,null,null,null,null,null,null," ",null,null,null," "," ",null," "," "]
[null,{"$f":"Info!$C$6&Info!$D$6","v":"Công trình: Công trình xây dựng …"},null,null,null,null,null,null,null,null,null,null,null,null,null," ",null,null,null," "," ",null," "," "]
[null,{"$f":"Info!$C$7&Info!$D$7","v":"Tên gói thầu: Thi công xây lắp …"},null,null,null,null,null,null,null,null,null,null,null,null,null," ",null,null,null," "," ",null," "," "]
[null,null,null,null,null,null,null,null,null,null,null,null,null,null,null," ",null,null,null," "," ",null," "," "]
[null,"TT","ShHM","Số hiệu","Mã hiệu\nđơn giá","Mã hiệu định mức","Phụ lục vữa","Mã vật tư","Nội dung công việc","Đơn vị","Khối lượng","Hao phí\nđịnh mức","Đơn giá","Hệ số","Thành tiền","Thành phần chi phí",null,null,null,"Hao phí",null,"Ghi chú","MÃ TẬP ĐƠN GIÁ","MÃ CPĐ"]
[null,null,null,null,null,null,null,null,null,null,null,null,null,null,null,"Vật liệu","Vl phụ","Nhân công","Máy","Chính","Khác"]
[0,0,"[1']","[1'']",2,"[2']","[2'']","[2''']",3,4,5,6,7,8,9,10,11,12,13,14,15,16,17,18]
[null,null,null,null,"___","_____","_____","_____","_____","_____","_____","_____","_____","_____","_____","_____","_____","_____","_____","_____","_____","_____","___","___"]
[]
[]
[]
[]
[null,"KHÔNG XÓA",null,null,null,null,"KHÔNG XÓA",null,"DO NOT REMOVE",null,"KHÔNG XÓA",null,null,"KHÔNG XÓA",null,"DO NOT REMOVE",null,"KHÔNG XÓA","DO NOT REMOVE"]

{"sheet":"Hợp giá","index":22,"n_rows":14,"n_cols":22,"rows_kept":14,"cut":false,"hidden":true,"merged":[[5,21,6,21],[5,1,6,1],[5,2,6,2],[5,3,6,3],[5,5,6,5],[5,10,6,10],[5,4,6,4],[5,11,6,11],[5,20,6,20],[5,6,6,6],[5,7,6,7],[5,8,6,8],[5,9,6,9]]}
[null,null,null,"BẢNG GIÁ XÂY DỰNG TỔNG HỢP"]
[null,null,null,{"$f":"Info!$C$5&Info!$D$5","v":"Dự án: Dự án đầu tư xây dựng công trình …"},null,null,null,null,null,null,null,null," ",null,null,null," "]
[null,null,null,{"$f":"Info!$C$6&Info!$D$6","v":"Công trình: Công trình xây dựng …"},null,null,null,null,null,null,null,null," ",null,null,null," "]
[null,{"$f":"Info!$C$7&Info!$D$7","v":"Tên gói thầu: Thi công xây lắp …"},null,null,null,null,null,null,null,null,null,null," ",null,null,null," "]
[null,null,null,null,null,null,null,null,null,null,null,null," ",null,null,null," "]
[null,"TT","SHHM","Số hiệu Hợp Giá","Số hiệu ĐG","Mã hiệu\nđơn giá chi tiết","Thành phần công việc","Đơn vị tính","Khối lượng","Đơn giá","Hệ số","Giá xây dựng \ntổng hợp (đầy đủ)","Đơn giá chi tiết",null,null,null,"Thành phần chi phí",null,null,null,"Tổng cộng (không đầy đủ)","Khối lượng dự toán"]
[null,null,null,null,null,null,null,null,null,null,null,null,"Vật liệu","Vl phụ","Nhân công","Máy","Vật liệu","Vl phụ","Nhân công","Máy"]
[0,0,"[1']","[1a]▼","[1b]▼","[1c]▼",2,3,4,5,"[*]",6,"[7a]",11,"[8a]","[9a]","[7b]",11,"[8b]","[9b]",10,15]
[null,null,null,null,null,"___","_____","_____","_____","_____","_____","_____","_____","_____","_____","_____","_____","_____","_____","_____","_____","_____"]
[]
[]
[]
[]
[null,"KHÔNG XÓA",null,null,null,null,"DO NOT REMOVE",null,"KHÔNG XÓA",null,"KHÔNG XÓA",null,"DO NOT REMOVE",null,"KHÔNG XÓA","DO NOT REMOVE","DO NOT REMOVE",null,"KHÔNG XÓA","DO NOT REMOVE"]

{"sheet":"Phân tích hao phí","index":23,"n_rows":14,"n_cols":23,"rows_kept":14,"cut":false,"hidden":true,"merged":[[5,16,6,16],[5,21,6,21],[5,22,6,22],[5,7,6,7],[5,8,6,8],[5,9,6,9],[5,10,6,10],[5,6,6,6],[5,1,6,1],[5,2,6,2],[5,3,6,3],[5,4,6,4],[5,5,6,5]]}
[null,"BẢNG HAO PHÍ VẬT LIỆU, NHÂN CÔNG, MÁY VÀ THIẾT BỊ THI CÔNG CHO CÁC CÔNG TÁC XÂY DỰNG"]
[null,{"$f":"Info!$C$5&Info!$D$5","v":"Dự án: Dự án đầu tư xây dựng công trình …"}]
[null,{"$f":"Info!$C$6&Info!$D$6","v":"Công trình: Công trình xây dựng …"}]
[null,{"$f":"Info!$C$7&Info!$D$7","v":"Tên gói thầu: Thi công xây lắp …"}]
[null,null,null,null,null,null,null,null,null,null,null,null,null,null,null," ",null," ",null,null,null,null," "]
[null,"Stt","SHHM","Số hiệu","Mã hiệu\nđơn giá","Mã hiệu định mức","Phụ lục vữa","Mã vật tư","Tên công tác","Đơn vị","Khối lượng","Mức hao phí ",null,null,null,"Hao phí","Hệ số","Khối lượng hao phí",null,null,null,"Ghi chú","MÃ TẬP ĐƠN GIÁ"]
[null,null,null,null,null,null,null,null,null,null,null,"Vật liệu","Vl phụ","Nhân công","Máy","Khác",null,"Vật liệu","Vl phụ","Nhân công","Máy"]
[0,0,"[1']",2,3,4,"[2'']",5,6,7,8,9,7,10,11,12,13,14,11,15,16,17,17]
[null,null,null,null,"___","_____","_____","_____","_____","_____","_____","_____",null,null,null,"_____","_____","_____","_____","_____","_____","_____","___"]
[]
[]
[]
[]
[null,"KHÔNG XÓA",null,null,null,null,"KHÔNG XÓA",null,"DO NOT REMOVE",null,"KHÔNG XÓA",null,null,null,null,null,"KHÔNG XÓA","DO NOT REMOVE",null,"KHÔNG XÓA","DO NOT REMOVE"]

{"sheet":"Vật liệu VC-89","index":24,"n_rows":15,"n_cols":19,"rows_kept":15,"cut":false,"hidden":true,"merged":[[5,17,6,17],[5,18,6,18],[5,5,6,5],[5,12,6,12],[5,13,6,13],[5,14,6,14],[5,15,6,15],[5,16,6,16],[5,7,6,7],[5,9,6,9],[5,10,6,10],[5,11,6,11],[5,1,6,1],[5,2,6,2],[5,3,6,3],[5,4,6,4],[5,8,6,8],[5,6,6,6]]}
[null,"BẢNG TÍNH GIÁ VẬT LIỆU VẬN CHUYỂN ĐẾN HIỆN TRƯỜNG XÂY DỰNG"]
[null,"(Căn cứ theo Quyết định ban hành biểu giá cước vận chuyển hàng hóa bằng ô tô trên địa bàn tỉnh….)"]
[null,{"$f":"Info!$C$6&Info!$D$6","v":"Công trình: Công trình xây dựng …"}]
[null,{"$f":"Info!$C$7&Info!$D$7","v":"Tên gói thầu: Thi công xây lắp …"}]
[]
[null,"TT","MÃ HIỆU VẬT TƯ","TÊN VẬT TƯ","ĐƠN VỊ","TRỌNG LƯỢNG ĐƠN VỊ","KHỐI LƯỢNG","GIÁ MUA GỐC","NGUỒN MUA","HỆ SỐ BẬC HÀNG","PHƯƠNG TIỆN","TỔNG CỰ LY","CỰ LY\n(Km)","LOẠI ĐƯỜNG","CƯỚC VẬN CHUYỂN CÔNG BỐ","CƯỚC VC TOÀN CỰ LY","GIÁ VẬT LIỆU THÁNG","MÃ TẬP ĐƠN GIÁ","GHI CHÚ"]
[]
[null,1,{"$f":"\"[\"&COUNTA($B$8:B8)+1&\"]\"","v":"[2]"},{"$f":"\"[\"&COUNTA($B$8:C8)+1&\"]\"","v":"[3]"},{"$f":"\"[\"&COUNTA($B$8:D8)+1&\"]\"","v":"[4]"},{"$f":"\"[\"&COUNTA($B$8:E8)+1&\"]\"","v":"[5]"},{"$f":"\"[\"&COUNTA($B$8:F8)+1&\"]\"","v":"[6]"},{"$f":"\"[\"&COUNTA($B$8:G8)+1&\"]\"","v":"[7]"},{"$f":"\"[\"&COUNTA($B$8:H8)+1&\"]\"","v":"[8]"},{"$f":"\"[\"&COUNTA($B$8:I8)+1&\"]\"","v":"[9]"},{"$f":"\"[\"&COUNTA($B$8:J8)+1&\"]\"","v":"[10]"},null,"▼-Nhập","▼-Chọn",{"$f":"\"[\"&COUNTA($B$8:N8)+1&\"]\"","v":"[13]"},{"$f":"\"[\"&COUNTA($B$8:O8)+1&\"]\"","v":"[14]"},{"$f":"\"[\"&COUNTA($B$8:P8)+1&\"]\"","v":"[15]"},null,{"$f":"\"[\"&COUNTA($B$8:R8)+1&\"]\"","v":"[16]"}]
[]
[]
[]
[]
[]
[]
[null,"KHÔNG XÓA",null,null,null,null,"KHÔNG XÓA",null,null,null,"KHÔNG XÓA",null,null,null,null,null,null,null,"KHÔNG XÓA"]

{"sheet":"Tổng hợp vật tư","index":25,"n_rows":16,"n_cols":14,"rows_kept":16,"cut":false,"hidden":false,"merged":[[5,11,6,11],[5,10,6,10],[5,12,6,12],[5,13,6,13],[5,6,6,6],[5,7,6,7],[5,8,6,8],[5,9,6,9],[5,1,6,1],[5,2,6,2],[5,3,6,3],[5,4,6,4],[5,5,6,5]]}
[null,{"$f":"IF(MoEs=1,\"BẢNG TỔNG HỢP CHI PHÍ VẬT LIỆU, CHI PHÍ NHÂN CÔNG, CHI PHÍ MÁY THI CÔNG\",IF(OR(MoEs=2,MoEs=3),\"BẢNG TỔNG HỢP CHÊNH LỆCH VẬT TƯ\",\"BẢNG TỔNG HỢP VẬT TƯ\"))","v":"BẢNG TỔNG HỢP VẬT TƯ"}]
[null,{"$f":"Info!$C$5&Info!$D$5","v":"Dự án: Dự án đầu tư xây dựng công trình …"}]
[null,{"$f":"Info!$C$6&Info!$D$6","v":"Công trình: Công trình xây dựng …"}]
[null,{"$f":"Info!$C$7&Info!$D$7","v":"Tên gói thầu: Thi công xây lắp …"}]
[]
[null,"Stt","Mã hiệu","Nội dung","Đơn vị","Khối lượng","Đơn giá gốc","Đơn giá tháng","Chênh lệch","Thành tiền\nchênh lệch","Thành tiền","KHỐI LƯỢNG KHÁC","Mã tập đơn giá","Ghi chú"]
[]
[null,1,{"$f":"\"[\"&COUNTA($B$8:B8)+1&\"]\"","v":"[2]"},{"$f":"\"[\"&COUNTA($B$8:C8)+1&\"]\"","v":"[3]"},{"$f":"\"[\"&COUNTA($B$8:D8)+1&\"]\"","v":"[4]"},{"$f":"\"[\"&COUNTA($B$8:E8)+1&\"]\"","v":"[5]"},{"$f":"\"[\"&COUNTA($B$8:F8)+1&\"]\"","v":"[6]"},{"$f":"\"[\"&COUNTA($B$8:G8)+1&\"]\"","v":"[7]"},{"$f":"\"[\"&COUNTA($B$8:H8)+1&\"]\"","v":"[8]"},{"$f":"\"[\"&COUNTA($B$8:I8)+1&\"]\"","v":"[9]"},{"$f":"\"[\"&COUNTA($B$8:J8)+1&\"]\"","v":"[10]"},null,{"$f":"\"[\"&COUNTA($B$8:K8)+1&\"]\"","v":"[11]"},{"$f":"\"[\"&COUNTA($B$8:M8)+1&\"]\"","v":"[12]"}]
[null,"___","___","___","___","___","___","___","___","___","___","___","___","___"]
[]
[]
[]
[]
[]
[]
[null,"KHÔNG XÓA"]

{"sheet":"PLBC.Thẩmtra","index":26,"n_rows":38,"n_cols":15,"rows_kept":38,"cut":false,"hidden":true,"merged":[[24,5,24,7],[16,1,17,1],[16,14,17,14],[16,2,17,2],[1,1,1,14],[2,1,2,14],[4,1,4,14],[5,1,5,14],[16,11,16,13],[16,8,16,10],[16,5,16,7],[16,4,17,4],[16,3,17,3]]}
[]
[null,"CỘNG HÒA XÃ HỘI CHỦ NGHĨA VIỆT NAM"]
[null,"Độc lập - Tự do - Hạnh phúc"]
[]
[null,"PHỤ LỤC BÁO CÁO THẨM TRA"]
[null,"(Kèm theo Báo cáo thẩm tra số:…........ ngày … tháng … năm ….......)"]
[]
[null,"1. Sự phù hợp giữa khối lượng chủ yếu của dự toán với khối lượng thiết kế"]
[null,"STT","Mã hiệu","Tên công tác","Đơn vị","Khối lượng dự toán","Khối lượng thẩm tra","Chênh lệch","Ghi chú"]
[null,"[1]","[2]","[3]","[4]","[5]","[6]","[7]","[8]"]
[]
[]
[]
[]
[null,"2. Tính đúng đắn, hợp lý của việc áp dụng, vận dụng định mức, đơn giá xây dựng công trình."]
[null,"a. Về Đơn giá xây dựng công trình:"]
[null,"STT","Mã hiệu","Tên công tác","Đơn vị","Đơn giá dự toán lập",null,null,"Đơn giá dự toán thẩm tra",null,null,"Chênh lệch đơn giá",null,null,"Ghi chú"]
[null,null,null,null,null,"Vật liệu","Nhân công","Máy thi công","Vật liệu","Nhân công","Máy thi công","Vật liệu","Nhân công","Máy thi công"]
[null,"[1]","[2]","[3]","[4]","[5]","[6]","[7]","[8]","[9]","[10]","[11]","[12]","[13]","[14]"]
[]
[]
[]
[]
[null,"b. Về hao phí định mức:"]
[null,"STT","Mã hiệu","Tên công tác","Đơn vị","Ý kiến thẩm tra",null,null,"Ghi chú"]
[null,"[1]","[2]","[3]","[4]",null,"[5]",null,"[6]"]
[]
[]
[]
[]
[null,"c. Về giá vật tư gốc"]
[null,"STT","Mã hiệu","Tên vật tư","Đơn vị","Đơn giá gốc\n(dự toán lập)","Đơn giá gốc\n(thẩm tra)","Chênh lệch","Ghi chú"]
[null,"[1]","[2]","[3]","[4]","[5]","[6]","[7]","[8]"]
[]
[]
[]
[]
[null,"3. Giá trị dự toán xây dựng sau thẩm tra là: ……………… (giá trị dự toán ghi bằng chữ), trong đó:"]

{"sheet":"Báo cáo","index":27,"n_rows":20,"n_cols":11,"rows_kept":20,"cut":false,"hidden":true,"merged":[[3,1,3,2],[2,4,2,7],[1,4,1,7],[7,1,7,7],[10,1,10,7],[8,1,8,7],[9,1,9,7]]}
[]
[null,"CƠ QUAN THẨM TRA/THẨM ĐỊNH",null,null,"CỘNG HÒA XÃ HỘI CHỦ NGHĨA VIỆT NAM"]
[null,null,null,null,"Độc lập - Tự do - Hạnh phúc "]
[null,"Số: …………..\nV/v thông báo kết quả thẩm định thiết kế và dự toán xây dựng công trình",null,null,null,null,null,"………, ngày …. tháng …. năm …..",null,"Tên cơ quan:","(Đơn vị thẩm tra/Thẩm định)"]
[]
[null,null,"Kính gửi: …………………………….."]
[]
[null,"         (Cơ quan thẩm tra/thẩm định) đã nhận Tờ trình số .... ngày …. của ………. đề nghị thẩm định thiết kế xây dựng (TKKT/TKBVTC) và dự toán xây dựng (nếu có) công trình …….. thuộc dự án đầu tư ........"]
[null,"         Căn cứ hồ sơ trình thẩm định gửi kèm tờ trình thẩm định;"]
[null,"         Các căn cứ khác có liên quan .................................................................."]
[null,"         Sau khi xem xét, (cơ quan thẩm định) thông báo kết quả thẩm định thiết kế xây dựng và dự toán xây dựng công trình như sau:"]
[null,"I. THÔNG TIN CHUNG VỀ CÔNG TRÌNH"]
[null,{"$f":"\" - Tên công trình: \"&Info!$D$6","v":" - Tên công trình: Công trình xây dựng …"}]
[null,{"$f":"\" - Thuộc dự án đầu tư: \"&Info!$D$5","v":" - Thuộc dự án đầu tư: Dự án đầu tư xây dựng công trình …"}]
[null," - Chủ đầu tư: ............................................................................................... "]
[null," - Giá trị dự toán xây dựng công trình: ........................................................... "]
[null," - Nguồn vốn: ......................................................................................... "]
[null,{"$f":"\" - Địa điểm xây dựng: \"&Info!D8","v":" - Địa điểm xây dựng: Hà Nội …"}]
[null," - Nhà thầu thiết kế xây dựng công trình, lập dự toán xây dựng (nếu có)"]
[null," - Nhà thầu khảo sát xây dựng .................................................................. "]

{"sheet":"Giá vữa","index":28,"n_rows":17,"n_cols":11,"rows_kept":17,"cut":false,"hidden":true,"merged":[[5,7,6,7],[5,8,6,8],[5,10,6,10],[5,9,6,9],[5,1,6,1],[5,2,6,2],[5,3,6,3],[5,4,6,4],[5,5,6,5],[5,6,6,6]]}
[null,"BẢNG GIÁ VỮA"]
[null,{"$f":"Info!$C$5&Info!$D$5","v":"Dự án: Dự án đầu tư xây dựng công trình …"}]
[null,{"$f":"Info!$C$6&Info!$D$6","v":"Công trình: Công trình xây dựng …"}]
[null,{"$f":"Info!$C$7&Info!$D$7","v":"Tên gói thầu: Thi công xây lắp …"}]
[]
[null,"Stt","Mã vữa","Mã vật tư","Tên vữa/ Tên vật tư","Đơn vị","Hao phí định mức","Đơn giá tháng","Thành tiền","Ghi chú","Mã tập đơn giá"]
[]
[null,1,{"$f":"\"[\"&COUNTA($B$8:B8)+1&\"]\"","v":"[2]"},{"$f":"\"[\"&COUNTA($B$8:C8)+1&\"]\"","v":"[3]"},{"$f":"\"[\"&COUNTA($B$8:D8)+1&\"]\"","v":"[4]"},{"$f":"\"[\"&COUNTA($B$8:E8)+1&\"]\"","v":"[5]"},{"$f":"\"[\"&COUNTA($B$8:F8)+1&\"]\"","v":"[6]"},{"$f":"\"[\"&COUNTA($B$8:G8)+1&\"]\"","v":"[7]"},{"$f":"\"[\"&COUNTA($B$8:H8)+1&\"]\"","v":"[8]"},{"$f":"\"[\"&COUNTA($B$8:I8)+1&\"]\"","v":"[9]"},{"$f":"\"[\"&COUNTA($B$8:J8)+1&\"]\"","v":"[10]"}]
[null,"___","___",null,"___","___","___","___","___","___","___"]
[]
[]
[]
[]
[]
[]
[]
[null,"KHÔNG XÓA",null,null,null,null,"DO NOT REMOVE",null,"DO NOT REMOVE"]

{"sheet":"Giá Vật liệu đến HTCT","index":29,"n_rows":16,"n_cols":39,"rows_kept":16,"cut":false,"hidden":true,"merged":[[5,38,7,38],[5,36,7,36],[6,6,7,6],[6,7,7,7],[5,1,7,1],[5,2,7,2],[5,3,7,3],[5,4,7,4],[5,5,7,5],[6,25,7,25],[6,18,7,18],[6,33,7,33],[6,35,7,35],[5,37,7,37],[6,34,7,34]]}
[null,"BẢNG TÍNH GIÁ VẬT LIỆU VẬN CHUYỂN ĐẾN HIỆN TRƯỜNG CÔNG TRÌNH"]
[null,"(Căn cứ Bảng 4.1 - Thông tư 11/2021/TT-BXD và Chương XII - Phụ lục 2 Thông tư 12/2021/TT-BXD)"]
[null,{"$f":"Info!$C$5&Info!$D$5","v":"Dự án: Dự án đầu tư xây dựng công trình …"}]
[null,{"$f":"Info!$C$6&Info!$D$6","v":"Công trình: Công trình xây dựng …"}]
[]
[null,"TT","Mã hiệu vật tư","Loại vật liệu","Đơn vị","KHỐI LƯỢNG","GIÁ VẬT LIỆU ĐẾN CÔNG TRÌNH",null,null,null,null,null,null,null,null,null,null,null,null,null,null,null,null,null,null,null,null,null,null,null,null,null,null,null,null,null,"GIÁ VẬT LIỆU ĐẾN HIỆN TRƯỜNG CÔNG TRÌNH","MÃ TẬP ĐƠN GIÁ","GHI CHÚ"]
[null,null,null,null,null,null,"Nguồn mua","Giá tại nguồn","Tra chi phí vận chuyển đến công trình",null,null,null,null,null,null,null,null,null,"Chi phí vận chuyển đến công trình","Tra chi phí bốc xếp vật liệu",null,null,null,null,null,"Chi phí bốc xếp vật liệu","Tra Chi phí vận chuyển nội bộ công trình ",null,null,null,null,null,null,"Chi phí vận chuyển nội bộ công trình ","Định mức hao hụt bảo quản tại hiện trường","Chi phí hao hụt bảo quản"]
[null,null,null,null,null,null,null,null,"Tra mã vận chuyển (ô tô)","Mã\nphương tiện","Loại\nphương tiện","Cự ly","Định mức máy (ca)","Giá ca máy","Hệ số đổi đơn vị","Điểm đầu - Điểm cuối","Loại đường","Hệ số điều chỉnh",null,"Tra mã\nbốc xếp","Mã\nphương tiện","Loại\nphương tiện","Định mức","Đơn giá","Hệ số đổi đơn vị",null,"Tra mã vận chuyển nội bộ","Mã\nphương tiện","Loại\nphương tiện","Cự ly","Định mức","Đơn giá","Hệ số đổi đơn vị"]
[null,1,"[2]","[2']","[3]","[*]","[*]","[4]","▼","[*]","[*]","[*]","[*]","[*]","[*]","[*]","[▼]",{"$f":"HSDCLoaiduong","v":""},"[5]","▼","[*]","[*]","[*]","[*]","[*]","[6]","▼","[*]","[*]","[*]","[*]","[*]","[*]","[7]","[*]","[8]","[9]","[*]","[*]"]
[null,"___","___","___","___","___",null,"___",null,null,null,null,null,null,null,null,null,"",null,null,null,null,null,null,null,null,null,null,null,null,null,null,null,null,null,null,"___","___","___"]
[]
[]
[]
[]
[]
[null,"KHÔNG XÓA",null,null,null,"KHÔNG XÓA",null,null,"KHÔNG XÓA",null,null,null,"KHÔNG XÓA",null,null,null,null,null,null,"KHÔNG XÓA",null,null,null,null,null,null,"KHÔNG XÓA",null,null,null,null,null,null,null,null,null,null,null,"KHÔNG XÓA"]

{"sheet":"Giá ca máy (VCVL)","index":30,"n_rows":28,"n_cols":26,"rows_kept":28,"cut":false,"hidden":true,"merged":[[5,17,6,17],[5,1,6,1],[5,2,6,2],[5,3,6,3],[5,4,6,4],[5,5,6,5],[5,6,6,6],[5,7,5,9],[5,10,5,12],[5,13,5,14],[5,15,6,15],[5,16,6,16],[5,24,6,24],[5,25,6,25],[5,18,6,18],[5,19,6,19],[5,20,6,20],[5,21,6,21],[5,22,6,22],[5,23,6,23]]}
[null,"BẢNG ĐƠN GIÁ PHƯƠNG TIỆN VẬN CHUYỂN VẬT LIỆU ĐẾN HIỆN TRƯỜNG XÂY DỰNG"]
[null,{"$f":"Info!$C$5&Info!$D$5","v":"Dự án: Dự án đầu tư xây dựng công trình …"}]
[null,{"$f":"Info!$C$6&Info!$D$6","v":"Công trình: Công trình xây dựng …"}]
[null,{"$f":"Info!$C$7&Info!$D$7","v":"Tên gói thầu: Thi công xây lắp …"}]
[]
[null,"TT","Mã phương tiện","Tên phương tiện","Số ca năm","Nguyên giá","Hệ số thu hồi","Định mức tỷ lệ (%)",null,null,"Chi phí",null,null,"Định mức tiêu hao nhiên liệu",null,"Hệ số nhiên liệu phụ","Chi phí nhiên liệu gốc","Chi phí nhiên liệu lập dự toán","Thành phần bậc thợ điều khiển","Mã Nhân công điều khiển","Lương NC điều khiển gốc","Lương NC điều khiển thời điểm lập dự toán","Giá ca máy gốc","Giá ca máy","Mã tập đơn giá","Ghi chú"]
[null,null,null,null,null,null,null,"Khấu hao","Sửa chữa","Chi phí khác","Khấu hao","Sửa chữa","Chi phí khác","Hao phí","Đơn vị"]
[null,"[1]",{"$f":"\"[\"&COUNTA($B$8:B8)+1&\"]\"","v":"[2]"},{"$f":"\"[\"&COUNTA($A$8:C8)+1&\"]\"","v":"[3]"},{"$f":"\"[\"&COUNTA($A$8:D8)+1&\"]\"","v":"[4]"},{"$f":"\"[\"&COUNTA($A$8:E8)+1&\"]\"","v":"[5]"},{"$f":"\"[\"&COUNTA($A$8:F8)+1&\"]\"","v":"[6]"},{"$f":"\"[\"&COUNTA($A$8:G8)+1&\"]\"","v":"[7]"},{"$f":"\"[\"&COUNTA($A$8:H8)+1&\"]\"","v":"[8]"},{"$f":"\"[\"&COUNTA($A$8:I8)+1&\"]\"","v":"[9]"},{"$f":"\"[\"&COUNTA($A$8:J8)+1&\"]\"","v":"[10]"},{"$f":"\"[\"&COUNTA($A$8:K8)+1&\"]\"","v":"[11]"},{"$f":"\"[\"&COUNTA($A$8:L8)+1&\"]\"","v":"[12]"},{"$f":"\"[\"&COUNTA($A$8:M8)+1&\"]\"","v":"[13]"},{"$f":"\"[\"&COUNTA($A$8:N8)+1&\"]\"","v":"[14]"},{"$f":"\"[\"&COUNTA($A$8:O8)+1&\"]\"","v":"[15]"},{"$f":"\"[\"&COUNTA($A$8:P8)+1&\"]\"","v":"[16]"},{"$f":"\"[\"&COUNTA($A$8:Q8)+1&\"]\"","v":"[17]"},{"$f":"\"[\"&COUNTA($A$8:R8)+1&\"]\"","v":"[18]"},"[\"\"]",{"$f":"\"[\"&COUNTA($A$8:S8)+1&\"]\"","v":"[19]"},{"$f":"\"[\"&COUNTA($A$8:U8)+1&\"]\"","v":"[21]"},{"$f":"\"[\"&COUNTA($A$8:V8)+1&\"]\"","v":"[22]"},{"$f":"\"[\"&COUNTA($A$8:W8)+1&\"]\"","v":"[23]"},{"$f":"\"[\"&COUNTA($A$8:X8)+1&\"]\"","v":"[24]"},{"$f":"\"[\"&COUNTA($A$8:Y8)+1&\"]\"","v":"[25]"}]
[null,"___","___","___","___","___","___","___",null,null,"___",null,null,"___",null,null,null,null,"___",null,null,null,null,null,null,"___"]
[null,1,"N01.01.307","Nhân công 3,0/7"]
[null,2,"M102.0103","Cần trục ôtô 5T"]
[null,3,"M102.0201","Cần cẩu 6T"]
[null,4,"M102.1001","Vận thăng lồng <= 3T"]
[null,5,"M106.0202","Ôtô tự đổ 5T"]
[null,6,"M106.0203","Ôtô tự đổ 7T"]
[null,7,"M106.0204","Ôtô tự đổ 10T"]
[null,8,"M106.0205","Ôtô tự đổ 12T"]
[null,9,"M106.0207","Ôtô tự đổ 20T"]
[null,10,"M106.0208","Ôtô tự đổ 22T"]
[null,11,"M106.0210","Ôtô tự đổ 27T"]
[null,12,"M106.0106","Ôtô thùng 7T"]
[null,13,"M106.0108","Ôtô thùng 12T"]
[null,14,"M106.0110","Ôtô thùng 20T"]
[null,15,"M106.0901","Xe bồn 30T"]
[]
[]
[]
[null,"KHÔNG XÓA",null,null,null,"KHÔNG XÓA",null,"DO NOT REMOVE",null,null,"DO NOT REMOVE",null,null,null,null,null,null,null,"KHÔNG XÓA",null,null,null,null,null,null,"KHÔNG XÓA"]

{"sheet":"Đơn giá NC","index":31,"n_rows":15,"n_cols":9,"rows_kept":15,"cut":false,"hidden":true,"merged":[]}
[null,"BẢNG ĐƠN GIÁ NHÂN CÔNG"]
[null,{"$f":"Info!$C$5&Info!$D$5","v":"Dự án: Dự án đầu tư xây dựng công trình …"}]
[null,{"$f":"Info!$C$6&Info!$D$6","v":"Công trình: Công trình xây dựng …"}]
[null,{"$f":"Info!$C$7&Info!$D$7","v":"Tên gói thầu: Thi công xây lắp …"}]
[null,"Lương đầu vào:",null,2000000]
[null,"TT","Mã nhân công","Tên nhân công","Hệ số lương","Hệ số khu vực","Đơn giá\nnhân công","Ghi chú","Mã tập đơn giá"]
[null,1,{"$f":"\"[\"&COUNTA($B$7:B7)+1&\"]\"","v":"[2]"},{"$f":"\"[\"&COUNTA($B$7:C7)+1&\"]\"","v":"[3]"},{"$f":"\"[\"&COUNTA($B$7:D7)+1&\"]\"","v":"[4]"},{"$f":"\"[\"&COUNTA($B$7:E7)+1&\"]\"","v":"[5]"},{"$f":"\"[\"&COUNTA($B$7:F7)+1&\"]\"","v":"[6]"},{"$f":"\"[\"&COUNTA($B$7:G7)+1&\"]\"","v":"[7]"},{"$f":"\"[\"&COUNTA($B$7:H7)+1&\"]\"","v":"[8]"}]
[null,"___","___","___","___","___","___","___"]
[]
[]
[]
[]
[]
[]
[null,"KHÔNG XÓA",null,null,null,"KHÔNG XÓA",null,"KHÔNG XÓA"]

{"sheet":"Giá ca máy","index":32,"n_rows":16,"n_cols":26,"rows_kept":16,"cut":false,"hidden":true,"merged":[[5,20,6,20],[5,22,6,22],[5,23,6,23],[5,18,6,18],[5,25,6,25],[5,21,6,21],[5,24,6,24],[5,19,6,19],[5,1,6,1],[5,2,6,2],[5,3,6,3],[5,4,6,4],[5,5,6,5],[5,6,6,6],[5,7,5,9],[5,10,5,12],[5,13,5,14],[5,17,6,17],[5,15,6,15],[5,16,6,16]]}
[null,"BẢNG GIÁ CA MÁY THI CÔNG"]
[null,{"$f":"Info!$C$5&Info!$D$5","v":"Dự án: Dự án đầu tư xây dựng công trình …"}]
[null,{"$f":"Info!$C$6&Info!$D$6","v":"Công trình: Công trình xây dựng …"}]
[null,{"$f":"Info!$C$7&Info!$D$7","v":"Tên gói thầu: Thi công xây lắp …"}]
[]
[null,"TT","Mã máy","Tên máy","Số ca năm","Nguyên giá","Hệ số thu hồi","Định mức tỷ lệ (%)",null,null,"Chi phí",null,null,"Định mức tiêu hao nhiên liệu",null,"Hệ số nhiên liệu phụ","Chi phí nhiên liệu gốc","Chi phí nhiên liệu lập dự toán","Thành phần bậc thợ điều khiển","Mã Nhân công điều khiển","Lương NC điều khiển gốc","Lương NC điều khiển thời điểm lập dự toán","Giá ca máy gốc","Giá ca máy","Mã tập đơn giá","Ghi chú"]
[null,null,null,null,null,null,null,"Khấu hao","Sửa chữa","Chi phí khác","Khấu hao","Sửa chữa","Chi phí khác","Hao phí","Đơn vị"]
[null,1,{"$f":"\"[\"&COUNTA($B$8:B8)+1&\"]\"","v":"[2]"},{"$f":"\"[\"&COUNTA($B$8:C8)+1&\"]\"","v":"[3]"},{"$f":"\"[\"&COUNTA($B$8:D8)+1&\"]\"","v":"[4]"},{"$f":"\"[\"&COUNTA($B$8:E8)+1&\"]\"","v":"[5]"},{"$f":"\"[\"&COUNTA($B$8:F8)+1&\"]\"","v":"[6]"},{"$f":"\"[\"&COUNTA($B$8:G8)+1&\"]\"","v":"[7]"},{"$f":"\"[\"&COUNTA($B$8:H8)+1&\"]\"","v":"[8]"},{"$f":"\"[\"&COUNTA($B$8:I8)+1&\"]\"","v":"[9]"},{"$f":"\"[\"&COUNTA($B$8:J8)+1&\"]\"","v":"[10]"},{"$f":"\"[\"&COUNTA($B$8:K8)+1&\"]\"","v":"[11]"},{"$f":"\"[\"&COUNTA($B$8:L8)+1&\"]\"","v":"[12]"},{"$f":"\"[\"&COUNTA($B$8:M8)+1&\"]\"","v":"[13]"},{"$f":"\"[\"&COUNTA($B$8:N8)+1&\"]\"","v":"[14]"},{"$f":"\"[\"&COUNTA($B$8:O8)+1&\"]\"","v":"[15]"},{"$f":"\"[\"&COUNTA($B$8:P8)+1&\"]\"","v":"[16]"},{"$f":"\"[\"&COUNTA($B$8:Q8)+1&\"]\"","v":"[17]"},{"$f":"\"[\"&COUNTA($B$8:R8)+1&\"]\"","v":"[18]"},null,{"$f":"\"[\"&COUNTA($B$8:S8)+1&\"]\"","v":"[19]"},{"$f":"\"[\"&COUNTA($B$8:U8)+1&\"]\"","v":"[20]"},{"$f":"\"[\"&COUNTA($B$8:V8)+1&\"]\"","v":"[21]"},{"$f":"\"[\"&COUNTA($B$8:W8)+1&\"]\"","v":"[22]"},{"$f":"\"[\"&COUNTA($B$8:X8)+1&\"]\"","v":"[23]"},{"$f":"\"[\"&COUNTA($B$8:Y8)+1&\"]\"","v":"[24]"}]
[null,"___","___","___","___","___","___","___",null,null,"___",null,null,"___",null,null,null,null,"___",null,null,null,null,null,null,"___"]
[]
[]
[]
[]
[]
[]
[null,"KHÔNG XÓA",null,null,null,"KHÔNG XÓA",null,"DO NOT REMOVE",null,null,"DO NOT REMOVE",null,null,null,null,null,null,null,"KHÔNG XÓA",null,null,null,null,null,null,"KHÔNG XÓA"]

{"sheet":"Lương Lái máy","index":33,"n_rows":45,"n_cols":14,"rows_kept":45,"cut":false,"hidden":true,"merged":[]}
[null,"BẢNG ĐƠN GIÁ NHÂN CÔNG ĐIỀU KHIỂN MÁY",null,null,null,null,null,null,null,null,null,null,null," "]
[null,{"$f":"Info!$C$5&Info!$D$5","v":"Dự án: Dự án đầu tư xây dựng công trình …"}]
[null,{"$f":"Info!$C$6&Info!$D$6","v":"Công trình: Công trình xây dựng …"}]
[null,{"$f":"Info!$C$7&Info!$D$7","v":"Tên gói thầu: Thi công xây lắp …"}]
[null,null,null,null,null,null,null,null,"Lương đầu vào:",null,{"$f":"LUONGCS","v":2000000}]
[null,"TT","Mã máy","Tên máy","Số ca máy\nthi công","Số thợ điều khiển","Mã nhân công","Tên nhân công","Hệ số lương","Hệ số khu vực","Đơn giá\nnhân công","Mã tập đơn giá","Ghi chú"]
[null,1,{"$f":"\"[\"&COUNTA(Col_STT)+1&\"]\"","v":"[2]"},3,4,5,6,7,8,9,10,11,11]
[null,"___","___","___","___","___","___","___","___","___","___",null,"___"]
[]
[]
[]
[]
[]
[]
[]
[]
[]
[]
[null,"BẢNG ĐƠN GIÁ NHÂN CÔNG ĐIỀU KHIỂN PHƯƠNG TIỆN VẬN CHUYỂN VẬT LIỆU"]
[]
[null,"TT","Mã máy","Tên máy","Số ca máy\nthi công","Số thợ điều khiển","Mã nhân công","Tên nhân công","Hệ số lương","Hệ số khu vực","Đơn giá\nnhân công","Mã tập đơn giá","Ghi chú"]
[null,1,{"$f":"\"[\"&COUNTA(Col_STT)+1&\"]\"","v":"[2]"},3,4,5,6,7,8,9,10,11,11]
[]
[]
[]
[]
[]
[]
[]
[]
[]
[]
[]
[]
[]
[]
[]
[]
[]
[]
[]
[]
[]
[]
[null,"_",null,null,null,null,null,null,null,null,null,null,"_"]

{"sheet":"CB ĐGNC","index":34,"n_rows":42,"n_cols":4,"rows_kept":42,"cut":false,"hidden":true,"merged":[]}
[]
[null,"CÔNG BỐ ĐƠN GIÁ NHÂN CÔNG XÂY DỰNG CỦA ĐỊA PHƯƠNG XÁC ĐỊNH THEO PHỤ LỤC IV THÔNG TƯ 13/2021/TT-BXD"]
[]
[null,"Stt","Nhóm","Đơn giá nhân công xây dựng bình quân theo khu vực (đ/ngc)"]
[null,"[1]","[2]","[3]"]
[null,"I","Công nhân xây dựng trực tiếp"]
[null,"1.1","Nhóm I"]
[null,"1.2","Nhóm II"]
[null,"1.3","Nhóm III"]
[null,"1.4","Nhóm IV"]
[null,null,"Nhóm vận hành máy, thiết bị thi công xây dựng"]
[null,null,"Nhóm lái xe các loại"]
[null,"II","Nhóm nhân công khác"]
[null,"2.1","Vận hành tàu, thuyền"]
[null,null,"Thuyền trưởng"]
[null,null,"Thuyền phó"]
[null,null,"Thủy thủ, thợ máy"]
[null,null,"Máy trưởng, máy I, máy II, điện trưởng, kỹ thuật viên cuốc I, kỹ thuật viên cuốc II tàu sông"]
[null,null,"Máy trưởng, máy I, máy II, điện trưởng, kỹ thuật viên cuốc I, kỹ thuật viên cuốc II tàu biển"]
[null,"2.2","Thợ lặn"]
[null,"2.3","Kỹ sư"]
[null,"2.4","Nghệ nhân"]
[null,"III","Nhân công tàu thuyền mở rộng (nếu có)"]
[null,1,"Thợ điều khiển tàu, ca nô công suất máy chính từ 5CV đến 150CV"]
[null,"1.1","Thuyền trưởng bậc 1,5/2",{"$f":"D15","v":0}]
[null,"1.2","Thuyền phó 1, máy 1 bậc 1,5/2",{"$f":"D16","v":0}]
[null,"1.3","Thuyền phó 2, máy 2 bậc 1,5/2",{"$f":"D16","v":0}]
[null,2,"Thợ điều khiển tàu, ca nô công suất máy chính trên 150CV; cần cẩu nổi; tàu đóng cọc"]
[null,"2.1","Thuyền trưởng bậc 1,5/2",{"$f":"D15","v":0}]
[null,"2.2","Thuyền phó 1, máy 1 bậc 1,5/2",{"$f":"D16","v":0}]
[null,"2.3","Thuyền phó 2, máy 2 bậc 1,5/2",{"$f":"D16","v":0}]
[null,3,"Thợ điều khiển tàu sông từ 150m3/h đến 300m3/h (tàu hút đến 585CV, tàu hút bụng tự hành đến 1390CV, tàu cuốc sông)"]
[null,"3.1","Thuyền trưởng tàu hút sông bậc 1,5/2",{"$f":"D15","v":0}]
[null,"3.2","Máy trưởng tàu hút sông bậc 1,5/2",{"$f":"D18","v":0}]
[null,"3.3","Máy 2, KTV cuốc 1, thuyền phó tàu hút sông bậc 1,5/2",{"$f":"D18","v":0}]
[null,"3.4","KTV cuốc 2 tàu hút sông bậc 1,5/2",{"$f":"D18","v":0}]
[null,4,"Thợ điều khiển tàu biển từ 300m3/h đến 800m3/h (tàu hút đến 585CV, tàu hút bụng tự hành đến 1390CV, tàu cuốc biển, tàu ngoạm)"]
[null,"4.1","Thuyền trưởng tàu hút bụng bậc 1,5/2",{"$f":"D15","v":0}]
[null,"4.2","Máy trưởng, thuyền trưởng tàu cuốc, tàu hút phun, tàu đào gầu ngoạm bậc 1,5/2",{"$f":"D19","v":0}]
[null,"4.3","Điện trưởng tàu hút, tàu cuốc; KTV cuốc 1, thuyền phó 2 tàu hút bụng, KTV cuốc 2 tàu cuốc, tàu hút phun, tàu đào gầu ngoạm bậc 1,5/2",{"$f":"D19","v":0}]
[null,"4.4","Máy 2; KTV cuốc 1 tàu cuốc, tàu hút phun, tàu đào gầu ngoạm bậc 1,5/2",{"$f":"D19","v":0}]
[null,"4.5","Thuyền phó tàu cuốc, KTV cuốc 2 tàu hút bậc 1,5/2",{"$f":"D19","v":0}]

{"sheet":"Bảng lương","index":35,"n_rows":478,"n_cols":7,"rows_kept":478,"cut":false,"hidden":true,"merged":[[465,2,465,5],[261,2,261,5],[358,2,358,5],[455,2,455,5],[7,6,37,6],[39,6,69,6],[71,6,101,6],[103,6,134,6],[180,6,182,6],[170,6,178,6],[135,6,139,6],[164,6,167,6],[142,6,162,6]]}
[]
[null,"BẢNG ĐƠN GIÁ NHÂN CÔNG XÂY DỰNG"]
[null,"(Theo Thông tư 15/2019/TT-BXD ngày 26/12/2019)"]
[]
[null,"Mã","Nhóm nghề","Cấp bậc","Hệ số cấp bậc","Giá Nhân công tỉnh","Ghi chú"]
[null,"I","Nhóm nhân công xây dựng ",null,"HiCB"]
[null,"1.1","Nhân công nhóm 1"]
[null,"N01.01.107","Nhân công bậc 1,0/7 - Nhóm 1",1,1,{"$f":"E8/E21*F21","v":0},"- Công tác phát cây, phá dỡ công trình, tháo dỡ kết cấu công trình, bộ phận máy móc, thiết bị công trình;\n- Công tác trồng cỏ các loại;\n- Công tác bốc xếp, vận chuyển vật tư, vật liệu, phụ kiện, cấu kiện xây dựng, phế thải xây dựng các loại;\n- Công tác đào, đắp, phá, bốc xúc, san, ủi, bơm, nạo vét, xói hút: bùn, đất, cát, đá, sỏi các loại, phế thải;\n- Công tác đóng gói vật liệu rời.                                                                                                                                                                           "]
[null,"N01.01.127","Nhân công bậc 1,2/7 - Nhóm 1",1.2,1.036,{"$f":"E9/E21*F21","v":0}]
[null,"N01.01.137","Nhân công bậc 1,3/7 - Nhóm 1",1.3,1.054,{"$f":"E10/E21*F21","v":0}]
[null,"N01.01.157","Nhân công bậc 1,5/7 - Nhóm 1",1.5,1.0899999999999999,{"$f":"E11/E21*F21","v":0}]
[null,"N01.01.177","Nhân công bậc 1,7/7 - Nhóm 1",1.7,1.1259999999999999,{"$f":"E12/E21*F21","v":0}]
[null,"N01.01.207","Nhân công bậc 2,0/7 - Nhóm 1",2,1.18,{"$f":"E13/E21*F21","v":0}]
[null,"N01.01.227","Nhân công bậc 2,2/7 - Nhóm 1",2.2000000000000002,1.222,{"$f":"E14/E21*F21","v":0}]
[null,"N01.01.237","Nhân công bậc 2,3/7 - Nhóm 1",2.2999999999999998,1.2429999999999999,{"$f":"E15/E21*F21","v":0}]
[null,"N01.01.257","Nhân công bậc 2,5/7 - Nhóm 1",2.5,1.2849999999999999,{"$f":"E16/E21*F21","v":0}]
[null,"N01.01.277","Nhân công bậc 2,7/7 - Nhóm 1",2.7,1.327,{"$f":"E17/E21*F21","v":0}]
[null,"N01.01.307","Nhân công bậc 3,0/7 - Nhóm 1",3,1.39,{"$f":"E18/E21*F21","v":0}]
[null,"N01.01.327","Nhân công bậc 3,2/7 - Nhóm 1",3.2,1.4419999999999999,{"$f":"E19/E21*F21","v":0}]
[null,"N01.01.337","Nhân công bậc 3,3/7 - Nhóm 1",3.3,1.468,{"$f":"E20/E21*F21","v":0}]
[null,"N01.01.357","Nhân công bậc 3,5/7 - Nhóm 1",3.5,1.52,{"$f":"'CB ĐGNC'!D7","v":0}]
[null,"N01.01.377","Nhân công bậc 3,7/7 - Nhóm 1",3.7,1.5720000000000001,{"$f":"E22/E21*F21","v":0}]
[null,"N01.01.407","Nhân công bậc 4,0/7 - Nhóm 1",4,1.65,{"$f":"E23/E21*F21","v":0}]
[null,"N01.01.427","Nhân công bậc 4,2/7 - Nhóm 1",4.2,1.708,{"$f":"E24/E21*F21","v":0}]
[null,"N01.01.437","Nhân công bậc 4,3/7 - Nhóm 1",4.3,1.7369999999999999,{"$f":"E25/E21*F21","v":0}]
[null,"N01.01.457","Nhân công bậc 4,5/7 - Nhóm 1",4.5,1.7949999999999999,{"$f":"E26/E21*F21","v":0}]
[null,"N01.01.477","Nhân công bậc 4,7/7 - Nhóm 1",4.7,1.853,{"$f":"E27/E21*F21","v":0}]
[null,"N01.01.507","Nhân công bậc 5,0/7 - Nhóm 1",5,1.94,{"$f":"E28/E21*F21","v":0}]
[null,"N01.01.527","Nhân công bậc 5,2/7 - Nhóm 1",5.2,2.012,{"$f":"E29/E21*F21","v":0}]
[null,"N01.01.537","Nhân công bậc 5,3/7 - Nhóm 1",5.3,2.048,{"$f":"E30/E21*F21","v":0}]
[null,"N01.01.557","Nhân công bậc 5,5/7 - Nhóm 1",5.5,2.12,{"$f":"E31/E21*F21","v":0}]
[null,"N01.01.577","Nhân công bậc 5,7/7 - Nhóm 1",5.7,2.1919999999999997,{"$f":"E32/E21*F21","v":0}]
[null,"N01.01.607","Nhân công bậc 6,0/7 - Nhóm 1",6,2.2999999999999998,{"$f":"E33/E21*F21","v":0}]
[null,"N01.01.627","Nhân công bậc 6,2/7 - Nhóm 1",6.2,2.3820000000000001,{"$f":"E34/E21*F21","v":0}]
[null,"N01.01.637","Nhân công bậc 6,3/7 - Nhóm 1",6.3,2.4229999999999996,{"$f":"E35/E21*F21","v":0}]
[null,"N01.01.657","Nhân công bậc 6,5/7 - Nhóm 1",6.5,2.5049999999999999,{"$f":"E36/E21*F21","v":0}]
[null,"N01.01.677","Nhân công bậc 6,7/7 - Nhóm 1",6.7,2.5870000000000002,{"$f":"E37/E21*F21","v":0}]
[null,"N01.01.707","Nhân công bậc 7,0/7 - Nhóm 1",7,2.71,{"$f":"E38/E21*F21","v":0}]
[null,"1.2","Nhân công nhóm 2"]
[null,"N01.02.107","Nhân công bậc 1,0/7 - Nhóm 2",1,1,{"$f":"E40/E53*F53","v":0},"Công tác xây dựng không thuộc nhóm I, nhóm III, nhóm IV.                                                                                                                                                                           "]
[null,"N01.02.127","Nhân công bậc 1,2/7 - Nhóm 2",1.2,1.036,{"$f":"E41/E53*F53","v":0}]
[null,"N01.02.137","Nhân công bậc 1,3/7 - Nhóm 2",1.3,1.054,{"$f":"E42/E53*F53","v":0}]
[null,"N01.02.157","Nhân công bậc 1,5/7 - Nhóm 2",1.5,1.0899999999999999,{"$f":"E43/E53*F53","v":0}]
[null,"N01.02.177","Nhân công bậc 1,7/7 - Nhóm 2",1.7,1.1259999999999999,{"$f":"E44/E53*F53","v":0}]
[null,"N01.02.207","Nhân công bậc 2,0/7 - Nhóm 2",2,1.18,{"$f":"E45/E53*F53","v":0}]
[null,"N01.02.227","Nhân công bậc 2,2/7 - Nhóm 2",2.2000000000000002,1.222,{"$f":"E46/E53*F53","v":0}]
[null,"N01.02.237","Nhân công bậc 2,3/7 - Nhóm 2",2.2999999999999998,1.2429999999999999,{"$f":"E47/E53*F53","v":0}]
[null,"N01.02.257","Nhân công bậc 2,5/7 - Nhóm 2",2.5,1.2849999999999999,{"$f":"E48/E53*F53","v":0}]
[null,"N01.02.277","Nhân công bậc 2,7/7 - Nhóm 2",2.7,1.327,{"$f":"E49/E53*F53","v":0}]
[null,"N01.02.307","Nhân công bậc 3,0/7 - Nhóm 2",3,1.39,{"$f":"E50/E53*F53","v":0}]
[null,"N01.02.327","Nhân công bậc 3,2/7 - Nhóm 2",3.2,1.4419999999999999,{"$f":"E51/E53*F53","v":0}]
[null,"N01.02.337","Nhân công bậc 3,3/7 - Nhóm 2",3.3,1.468,{"$f":"E52/E53*F53","v":0}]
[null,"N01.02.357","Nhân công bậc 3,5/7 - Nhóm 2",3.5,1.52,{"$f":"'CB ĐGNC'!D8","v":0}]
[null,"N01.02.377","Nhân công bậc 3,7/7 - Nhóm 2",3.7,1.5720000000000001,{"$f":"E54/E53*F53","v":0}]
[null,"N01.02.407","Nhân công bậc 4,0/7 - Nhóm 2",4,1.65,{"$f":"E55/E53*F53","v":0}]
[null,"N01.02.427","Nhân công bậc 4,2/7 - Nhóm 2",4.2,1.708,{"$f":"E56/E53*F53","v":0}]
[null,"N01.02.437","Nhân công bậc 4,3/7 - Nhóm 2",4.3,1.7369999999999999,{"$f":"E57/E53*F53","v":0}]
[null,"N01.02.457","Nhân công bậc 4,5/7 - Nhóm 2",4.5,1.7949999999999999,{"$f":"E58/E53*F53","v":0}]
[null,"N01.02.477","Nhân công bậc 4,7/7 - Nhóm 2",4.7,1.853,{"$f":"E59/E53*F53","v":0}]
[null,"N01.02.507","Nhân công bậc 5,0/7 - Nhóm 2",5,1.94,{"$f":"E60/E53*F53","v":0}]
[null,"N01.02.527","Nhân công bậc 5,2/7 - Nhóm 2",5.2,2.012,{"$f":"E61/E53*F53","v":0}]
[null,"N01.02.537","Nhân công bậc 5,3/7 - Nhóm 2",5.3,2.048,{"$f":"E62/E53*F53","v":0}]
[null,"N01.02.557","Nhân công bậc 5,5/7 - Nhóm 2",5.5,2.12,{"$f":"E63/E53*F53","v":0}]
[null,"N01.02.577","Nhân công bậc 5,7/7 - Nhóm 2",5.7,2.1919999999999997,{"$f":"E64/E53*F53","v":0}]
[null,"N01.02.607","Nhân công bậc 6,0/7 - Nhóm 2",6,2.2999999999999998,{"$f":"E65/E53*F53","v":0}]
[null,"N01.02.627","Nhân công bậc 6,2/7 - Nhóm 2",6.2,2.3820000000000001,{"$f":"E66/E53*F53","v":0}]
[null,"N01.02.637","Nhân công bậc 6,3/7 - Nhóm 2",6.3,2.4229999999999996,{"$f":"E67/E53*F53","v":0}]
[null,"N01.02.657","Nhân công bậc 6,5/7 - Nhóm 2",6.5,2.5049999999999999,{"$f":"E68/E53*F53","v":0}]
[null,"N01.02.677","Nhân công bậc 6,7/7 - Nhóm 2",6.7,2.5870000000000002,{"$f":"E69/E53*F53","v":0}]
[null,"N01.02.707","Nhân công bậc 7,0/7 - Nhóm 2",7,2.71,{"$f":"E70/E53*F53","v":0}]
[null,"1.3","Nhân công nhóm 3"]
[null,"N01.03.107","Nhân công bậc 1,0/7 - Nhóm 3",1,1,{"$f":"E72/E85*F85","v":0},"Công tác lắp đặt, sửa chữa máy và thiết bị công trình xây dựng, công nghệ xây dựng."]
[null,"N01.03.127","Nhân công bậc 1,2/7 - Nhóm 3",1.2,1.036,{"$f":"E73/E85*F85","v":0}]
[null,"N01.03.137","Nhân công bậc 1,3/7 - Nhóm 3",1.3,1.054,{"$f":"E74/E85*F85","v":0}]
[null,"N01.03.157","Nhân công bậc 1,5/7 - Nhóm 3",1.5,1.0899999999999999,{"$f":"E75/E85*F85","v":0}]
[null,"N01.03.177","Nhân công bậc 1,7/7 - Nhóm 3",1.7,1.1259999999999999,{"$f":"E76/E85*F85","v":0}]
[null,"N01.03.207","Nhân công bậc 2,0/7 - Nhóm 3",2,1.18,{"$f":"E77/E85*F85","v":0}]
[null,"N01.03.227","Nhân công bậc 2,2/7 - Nhóm 3",2.2000000000000002,1.222,{"$f":"E78/E85*F85","v":0}]
[null,"N01.03.237","Nhân công bậc 2,3/7 - Nhóm 3",2.2999999999999998,1.2429999999999999,{"$f":"E79/E85*F85","v":0}]
[null,"N01.03.257","Nhân công bậc 2,5/7 - Nhóm 3",2.5,1.2849999999999999,{"$f":"E80/E85*F85","v":0}]
[null,"N01.03.277","Nhân công bậc 2,7/7 - Nhóm 3",2.7,1.327,{"$f":"E81/E85*F85","v":0}]
[null,"N01.03.307","Nhân công bậc 3,0/7 - Nhóm 3",3,1.39,{"$f":"E82/E85*F85","v":0}]
[null,"N01.03.327","Nhân công bậc 3,2/7 - Nhóm 3",3.2,1.4419999999999999,{"$f":"E83/E85*F85","v":0}]
[null,"N01.03.337","Nhân công bậc 3,3/7 - Nhóm 3",3.3,1.468,{"$f":"E84/E85*F85","v":0}]
[null,"N01.03.357","Nhân công bậc 3,5/7 - Nhóm 3",3.5,1.52,{"$f":"'CB ĐGNC'!$D$9","v":0}]
[null,"N01.03.377","Nhân công bậc 3,7/7 - Nhóm 3",3.7,1.5720000000000001,{"$f":"E86/E85*F85","v":0}]
[null,"N01.03.407","Nhân công bậc 4,0/7 - Nhóm 3",4,1.65,{"$f":"E87/E85*F85","v":0}]
[null,"N01.03.427","Nhân công bậc 4,2/7 - Nhóm 3",4.2,1.708,{"$f":"E88/E85*F85","v":0}]
[null,"N01.03.437","Nhân công bậc 4,3/7 - Nhóm 3",4.3,1.7369999999999999,{"$f":"E89/E85*F85","v":0}]
[null,"N01.03.457","Nhân công bậc 4,5/7 - Nhóm 3",4.5,1.7949999999999999,{"$f":"E90/E85*F85","v":0}]
[null,"N01.03.477","Nhân công bậc 4,7/7 - Nhóm 3",4.7,1.853,{"$f":"E91/E85*F85","v":0}]
[null,"N01.03.507","Nhân công bậc 5,0/7 - Nhóm 3",5,1.94,{"$f":"E92/E85*F85","v":0}]
[null,"N01.03.527","Nhân công bậc 5,2/7 - Nhóm 3",5.2,2.012,{"$f":"E93/E85*F85","v":0}]
[null,"N01.03.537","Nhân công bậc 5,3/7 - Nhóm 3",5.3,2.048,{"$f":"E94/E85*F85","v":0}]
[null,"N01.03.557","Nhân công bậc 5,5/7 - Nhóm 3",5.5,2.12,{"$f":"E95/E85*F85","v":0}]
[null,"N01.03.577","Nhân công bậc 5,7/7 - Nhóm 3",5.7,2.1919999999999997,{"$f":"E96/E85*F85","v":0}]
[null,"N01.03.607","Nhân công bậc 6,0/7 - Nhóm 3",6,2.2999999999999998,{"$f":"E97/E85*F85","v":0}]
[null,"N01.03.627","Nhân công bậc 6,2/7 - Nhóm 3",6.2,2.3820000000000001,{"$f":"E98/E85*F85","v":0}]
[null,"N01.03.637","Nhân công bậc 6,3/7 - Nhóm 3",6.3,2.4229999999999996,{"$f":"E99/E85*F85","v":0}]
[null,"N01.03.657","Nhân công bậc 6,5/7 - Nhóm 3",6.5,2.5049999999999999,{"$f":"E100/E85*F85","v":0}]
[null,"N01.03.677","Nhân công bậc 6,7/7 - Nhóm 3",6.7,2.5870000000000002,{"$f":"E101/E85*F85","v":0}]
[null,"N01.03.707","Nhân công bậc 7,0/7 - Nhóm 3",7,2.71,{"$f":"E102/E85*F85","v":0}]
[null,"1.4","Nhân công nhóm 4"]
[null,null,"Nhân công vận hành máy, thiết bị thi công xây dựng",null,null,null,"Vận hành máy, thiết bị thi công xây dựng;"]
[null,"N01.04.107","Nhân công bậc 1,0/7 - Nhóm 4",1,1,{"$f":"E105/E118*F118","v":0}]
[null,"N01.04.127","Nhân công bậc 1,2/7 - Nhóm 4",1.2,1.036,{"$f":"E106/E118*F118","v":0}]
[null,"N01.04.137","Nhân công bậc 1,3/7 - Nhóm 4",1.3,1.054,{"$f":"E107/E118*F118","v":0}]
[null,"N01.04.157","Nhân công bậc 1,5/7 - Nhóm 4",1.5,1.0899999999999999,{"$f":"E108/E118*F118","v":0}]
[null,"N01.04.177","Nhân công bậc 1,7/7 - Nhóm 4",1.7,1.1259999999999999,{"$f":"E109/E118*F118","v":0}]
[null,"N01.04.207","Nhân công bậc 2,0/7 - Nhóm 4",2,1.18,{"$f":"E110/E118*F118","v":0}]
[null,"N01.04.227","Nhân công bậc 2,2/7 - Nhóm 4",2.2000000000000002,1.222,{"$f":"E111/E118*F118","v":0}]
[null,"N01.04.237","Nhân công bậc 2,3/7 - Nhóm 4",2.2999999999999998,1.2429999999999999,{"$f":"E112/E118*F118","v":0}]
[null,"N01.04.257","Nhân công bậc 2,5/7 - Nhóm 4",2.5,1.2849999999999999,{"$f":"E113/E118*F118","v":0}]
[null,"N01.04.277","Nhân công bậc 2,7/7 - Nhóm 4",2.7,1.327,{"$f":"E114/E118*F118","v":0}]
[null,"N01.04.307","Nhân công bậc 3,0/7 - Nhóm 4",3,1.39,{"$f":"E115/E118*F118","v":0}]
[null,"N01.04.327","Nhân công bậc 3,2/7 - Nhóm 4",3.2,1.4419999999999999,{"$f":"E116/E118*F118","v":0}]
[null,"N01.04.337","Nhân công bậc 3,3/7 - Nhóm 4",3.3,1.468,{"$f":"E117/E118*F118","v":0}]
[null,"N01.04.357","Nhân công bậc 3,5/7 - Nhóm 4",3.5,1.52,{"$f":"'CB ĐGNC'!$D$11","v":0}]
[null,"N01.04.377","Nhân công bậc 3,7/7 - Nhóm 4",3.7,1.5720000000000001,{"$f":"E119/E118*F118","v":0}]
[null,"N01.04.407","Nhân công bậc 4,0/7 - Nhóm 4",4,1.65,{"$f":"E120/E118*F118","v":0}]
[null,"N01.04.427","Nhân công bậc 4,2/7 - Nhóm 4",4.2,1.708,{"$f":"E121/E118*F118","v":0}]
[null,"N01.04.437","Nhân công bậc 4,3/7 - Nhóm 4",4.3,1.7369999999999999,{"$f":"E122/E118*F118","v":0}]
[null,"N01.04.457","Nhân công bậc 4,5/7 - Nhóm 4",4.5,1.7949999999999999,{"$f":"E123/E118*F118","v":0}]
[null,"N01.04.477","Nhân công bậc 4,7/7 - Nhóm 4",4.7,1.853,{"$f":"E124/E118*F118","v":0}]
[null,"N01.04.507","Nhân công bậc 5,0/7 - Nhóm 4",5,1.94,{"$f":"E125/E118*F118","v":0}]
[null,"N01.04.527","Nhân công bậc 5,2/7 - Nhóm 4",5.2,2.012,{"$f":"E126/E118*F118","v":0}]
[null,"N01.04.537","Nhân công bậc 5,3/7 - Nhóm 4",5.3,2.048,{"$f":"E127/E118*F118","v":0}]
[null,"N01.04.557","Nhân công bậc 5,5/7 - Nhóm 4",5.5,2.12,{"$f":"E128/E118*F118","v":0}]
[null,"N01.04.577","Nhân công bậc 5,7/7 - Nhóm 4",5.7,2.1919999999999997,{"$f":"E129/E118*F118","v":0}]
[null,"N01.04.607","Nhân công bậc 6,0/7 - Nhóm 4",6,2.2999999999999998,{"$f":"E130/E118*F118","v":0}]
[null,"N01.04.627","Nhân công bậc 6,2/7 - Nhóm 4",6.2,2.3820000000000001,{"$f":"E131/E118*F118","v":0}]
[null,"N01.04.637","Nhân công bậc 6,3/7 - Nhóm 4",6.3,2.4229999999999996,{"$f":"E132/E118*F118","v":0}]
[null,"N01.04.657","Nhân công bậc 6,5/7 - Nhóm 4",6.5,2.5049999999999999,{"$f":"E133/E118*F118","v":0}]
[null,"N01.04.677","Nhân công bậc 6,7/7 - Nhóm 4",6.7,2.5870000000000002,{"$f":"E134/E118*F118","v":0}]
[null,"N01.04.707","Nhân công bậc 7,0/7 - Nhóm 4",7,2.71,{"$f":"E135/E118*F118","v":0}]
[null,null,"Lái xe các loại",null,null,null,"Lái xe các loại"]
[null,"N01.04.104","Lái xe bậc 1,0/4 - Nhóm 4",1,1,{"$f":"E137/E138*F138","v":0}]
[null,"N01.04.204","Lái xe bậc 2,0/4 - Nhóm 4",2,1.18,{"$f":"'CB ĐGNC'!$D$12","v":0}]
[null,"N01.04.304","Lái xe bậc 3,0/4 - Nhóm 4",3,1.4,{"$f":"E139/E138*F138","v":0}]
[null,"N01.04.404","Lái xe bậc 4,0/4 - Nhóm 4",4,1.65,{"$f":"E140/E138*F138","v":0}]
[null,"II","Nhóm nhân khác"]
[null,"2.1","Nhân công vận hành tàu thuyền"]
[null,null,"Thuyền trưởng"]
[null,"N01.51.102","Thuyền trưởng bậc 1,0/2",1,1,{"$f":"$E144/$E$145*F$145","v":0}]
[null,"N01.51.152","Thuyền trưởng bậc 1,5/2",1.5,1.0249999999999999,{"$f":"'CB ĐGNC'!$D$15","v":0}]
[null,"N01.51.202","Thuyền trưởng bậc 2,0/2",2,1.05,{"$f":"$E146/$E$145*F$145","v":0}]
[null,null,"Thuyền phó"]
[null,"N01.52.102","Thuyền phó bậc 1,0/2",1,1,{"$f":"$E148/$E$149*F$149","v":0}]
[null,"N01.52.152","Thuyền phó bậc 1,5/2",1.5,1.0249999999999999,{"$f":"'CB ĐGNC'!$D$16","v":0}]
[null,"N01.52.202","Thuyền phó bậc 2,0/2",2,1.05,{"$f":"$E150/$E$149*F$149","v":0}]
[null,null,"Thủy thủ, thợ máy"]
[null,"N01.60.104","Thủy thủ, thợ máy bậc 1,0/4",1,1,{"$f":"$E152/$E$153*F$153","v":0}]
[null,"N01.60.204","Thủy thủ, thợ máy bậc 2,0/4",2,1.1299999999999999,{"$f":"'CB ĐGNC'!$D$17","v":0}]
[null,"N01.60.304","Thủy thủ, thợ máy bậc 3,0/4",3,1.3,{"$f":"$E154/$E$153*F$153","v":0}]
[null,"N01.60.404","Thủy thủ, thợ máy bậc 4,0/4",4,1.47,{"$f":"$E155/$E$153*F$153","v":0}]
[null,null,"Máy trưởng, máy I, máy II, điện trưởng, kỹ thuật viên cuốc I, kỹ thuật viên cuốc II tàu sông"]
[null,"N01.70.102","Thợ điều khiển tàu sông bậc 1,0/2",1,1,{"$f":"$E157/$E$158*F$158","v":0}]
[null,"N01.70.152","Thợ điều khiển tàu sông bậc 1,5/2",1.5,1.03,{"$f":"'CB ĐGNC'!$D$18","v":0}]
[null,"N01.70.202","Thợ điều khiển tàu sông bậc 2,0/2",2,1.06,{"$f":"$E159/$E$158*F$158","v":0}]
[null,null,"Máy trưởng, máy I, máy II, điện trưởng, kỹ thuật viên cuốc I, kỹ thuật viên cuốc II tàu biển"]
[null,"N01.80.102","Thợ điều khiển tàu biển bậc 1,0/2",1,1,{"$f":"$E161/$E$162*F$162","v":0}]
[null,"N01.80.152","Thợ điều khiển tàu biển bậc 1,5/2",1.5,1.02,{"$f":"'CB ĐGNC'!$D$19","v":0}]
[null,"N01.80.202","Thợ điều khiển tàu biển bậc 2,0/2",2,1.04,{"$f":"$E163/$E$162*F$162","v":0}]
[null,"2.2","Thợ lặn"]
[null,"N01.90.104","Thợ lặn bậc 1,0/4",1,1,{"$f":"$E165/$E$166*F$166","v":0},"Công tác lặn để thực hiện một số công việc dưới nước trong thi công xây dựng."]
[null,"N01.90.204","Thợ lặn bậc 2,0/4",2,1.1000000000000001,{"$f":"'CB ĐGNC'!$D$20","v":0}]
[null,"N01.90.304","Thợ lặn bậc 3,0/4",3,1.24,{"$f":"$E167/$E$166*F$166","v":0}]
[null,"N01.90.404","Thợ lặn bậc 4,0/4",4,1.39,{"$f":"$E168/$E$166*F$166","v":0}]
[null,"N01.90.104.0","Thợ lặn cấp I","I",{"$f":"E166","v":1.1000000000000001},{"$f":"$E169/$E$166*F$166","v":0},"Tạm lấy bằng Thợ lặn bậc 2/4"]
[null,"2.3","Kỹ sư"]
[null,"N01.20.108","Kỹ sư bậc 1,0/8",1,1,{"$f":"$E171/$E$174*F$174","v":0},"- Trực tiếp thực hiện các công việc khảo sát, thí nghiệm."]
[null,"N01.20.208","Kỹ sư bậc 2,0/8",2,1.1299999999999999,{"$f":"$E172/$E$174*F$174","v":0}]
[null,"N01.20.308","Kỹ sư bậc 3,0/8",3,1.26,{"$f":"$E173/$E$174*F$174","v":0}]
[null,"N01.20.408","Kỹ sư bậc 4,0/8",4,1.4,{"$f":"'CB ĐGNC'!$D$21","v":0}]
[null,"N01.20.458","Kỹ sư bậc 4,5/8",4.5,1.4649999999999999,{"$f":"$E175/$E$174*F$174","v":0}]
[null,"N01.20.508","Kỹ sư bậc 5,0/8",5,1.53,{"$f":"$E176/$E$174*F$174","v":0}]
[null,"N01.20.608","Kỹ sư bậc 6,0/8",6,1.66,{"$f":"$E177/$E$174*F$174","v":0}]
[null,"N01.20.708","Kỹ sư bậc 7,0/8",7,1.79,{"$f":"$E178/$E$174*F$174","v":0}]
[null,"N01.20.808","Kỹ sư bậc 8,0/8",8,1.93,{"$f":"$E179/$E$174*F$174","v":0}]
[null,"2.4","Nghệ nhân"]
[null,"N01.30.102","Nghệ nhân bậc 1,0/2",1,1,{"$f":"$E181/$E$182*F$182","v":0},"Chế tác đồ gỗ mỹ nghệ;\nChế tác đồ đá mỹ nghệ;\nChế tác tượng, biểu tượng."]
[null,"N01.30.152","Nghệ nhân bậc 1,5/2",1.5,1.04,{"$f":"'CB ĐGNC'!$D$22","v":0}]
[null,"N01.30.202","Nghệ nhân bậc 2,0/2",2,1.08,{"$f":"$E183/$E$182*F$182","v":0}]
[null,"III","Nhân công tàu thuyền mở rộng"]
[null,null,"Thợ điều khiển tàu, ca nô công suất máy chính từ 5CV đến 150CV"]
[null,null,"Thuyền trưởng"]
[null,"NT5CV.TT.102","Thuyền trưởng bậc 1/2",1,1,{"$f":"$E187/$E188*F188","v":0}]
[null,"NT5CV.TT.152","Thuyền trưởng bậc 1,5/2",1.5,1.0249999999999999,{"$f":"'CB ĐGNC'!$D$25","v":0}]
[null,"NT5CV.TT.202","Thuyền trưởng bậc 2/2",2,1.05,{"$f":"$E189/$E188*F188","v":0}]
[null,null,"Thuyền phó 1, máy 1"]
[null,"NT5CV.TP1.102","Thuyền phó 1, máy 1 bậc 1/2",1,1,{"$f":"$E191/$E192*F192","v":0}]
[null,"NT5CV.TP1.152","Thuyền phó 1, máy 1 bậc 1,5/2",1.5,1.0249999999999999,{"$f":"'CB ĐGNC'!$D$26","v":0}]
[null,"NT5CV.TP1.202","Thuyền phó 1, máy 1 bậc 2/2",2,1.05,{"$f":"$E193/$E192*F192","v":0}]
[null,null,"Thuyền phó 2, máy 2"]
[null,"NT5CV.TP2.102","Thuyền phó 2, máy 2 bậc 1/2",1,1,{"$f":"$E195/$E196*F196","v":0}]
[null,"NT5CV.TP2.152","Thuyền phó 2, máy 2 bậc 1,5/2",1.5,1.0249999999999999,{"$f":"'CB ĐGNC'!$D$27","v":0}]
[null,"NT5CV.TP2.2.2","Thuyền phó 2, máy 2 bậc 2/2",2,1.05,{"$f":"$E197/$E196*F196","v":0}]
[null,null,"Thợ điều khiển tàu, ca nô công suất máy chính trên 150CV; cần cẩu nổi; tàu đóng cọc"]
[null,null,"Thuyền trưởng"]
[null,"NT151CV.TT.102","Thuyền trưởng bậc 1/2",1,1,{"$f":"$E200/$E201*F201","v":0}]
[null,"NT151CV.TT.152","Thuyền trưởng bậc 1,5/2",1.5,1.0249999999999999,{"$f":"'CB ĐGNC'!$D$29","v":0}]
[null,"NT151CV.TT.202","Thuyền trưởng bậc 2/2",2,1.05,{"$f":"$E202/$E201*F201","v":0}]
[null,null,"Thuyền phó 1, máy 1"]
[null,"NT151CV.TP1.102","Thuyền phó 1, máy 1 bậc 1/2",1,1,{"$f":"$E204/$E205*F205","v":0}]
[null,"NT151CV.TP1.152","Thuyền phó 1, máy 1 bậc 1,5/2",1.5,1.0249999999999999,{"$f":"'CB ĐGNC'!$D$30","v":0}]
[null,"NT151CV.TP1.202","Thuyền phó 1, máy 1 bậc 2/2",2,1.05,{"$f":"$E206/$E205*F205","v":0}]
[null,null,"Thuyền phó 2, máy 2"]
[null,"NT151CV.TP2.102","Thuyền phó 2, máy 2 bậc 1/2",1,1,{"$f":"$E208/$E209*F209","v":0}]
[null,"NT151CV.TP2.152","Thuyền phó 2, máy 2 bậc 1,5/2",1.5,1.0249999999999999,{"$f":"'CB ĐGNC'!$D$31","v":0}]
[null,"NT151CV.TP2.202","Thuyền phó 2, máy 2 bậc 2/2",2,1.05,{"$f":"$E210/$E209*F209","v":0}]
[null,null,"Thợ điều khiển tàu sông từ 150m3/h đến 300m3/h (tàu hút đến 585CV, tàu hút bụng tự hành đến 1390CV, tàu cuốc sông)"]
[null,null,"Thuyền trưởng tàu hút sông"]
[null,"NTS.TT.102","Thuyền trưởng tàu hút sông bậc 1/2",1,1,{"$f":"$E213/$E214*F214","v":0}]
[null,"NTS.TT.152","Thuyền trưởng tàu hút sông bậc 1,5/2",1.5,1.03,{"$f":"'CB ĐGNC'!$D$33","v":0}]
[null,"NTS.TT.202","Thuyền trưởng tàu hút sông bậc 2/2",2,1.06,{"$f":"$E215/$E214*F214","v":0}]
[null,null,"Máy trưởng tàu hút sông"]
[null,"NTS.MT.102","Máy trưởng tàu hút sông bậc 1/2",1,1,{"$f":"$E217/$E218*F218","v":0}]
[null,"NTS.MT.152","Máy trưởng tàu hút sông bậc 1,5/2",1.5,1.03,{"$f":"'CB ĐGNC'!$D$34","v":0}]
[null,"NTS.MT.202","Máy trưởng tàu hút sông bậc 2/2",2,1.06,{"$f":"$E219/$E218*F218","v":0}]
[null,null,"Máy 2, KTV cuốc 1, thuyền phó tàu hút sông"]
[null,"NTS.M2.102","Máy 2, KTV cuốc 1, thuyền phó tàu hút sông bậc 1/2",1,1,{"$f":"$E221/$E222*F222","v":0}]
[null,"NTS.M2.152","Máy 2, KTV cuốc 1, thuyền phó tàu hút sông bậc 1,5/2",1.5,1.03,{"$f":"'CB ĐGNC'!$D$35","v":0}]
[null,"NTS.M2.202","Máy 2, KTV cuốc 1, thuyền phó tàu hút sông bậc 2/2",2,1.06,{"$f":"$E223/$E222*F222","v":0}]
[null,null,"KTV cuốc 2 tàu hút sông"]
[null,"NTS.KTV2.102","KTV cuốc 2 tàu hút sông bậc 1/2",1,1,{"$f":"$E225/$E226*F226","v":0}]
[null,"NTS.KTV2.152","KTV cuốc 2 tàu hút sông bậc 1,5/2",1.5,1.03,{"$f":"'CB ĐGNC'!$D$36","v":0}]
[null,"NTS.KTV2.202","KTV cuốc 2 tàu hút sông bậc 2/2",2,1.06,{"$f":"$E227/$E226*F226","v":0}]
[null,null,"Thợ điều khiển tàu biển từ 300m3/h đến 800m3/h (tàu hút đến 585CV, tàu hút bụng tự hành đến 1390CV, tàu cuốc biển, tàu ngoạm)"]
[null,null,"Thuyền trưởng tàu hút bụng"]
[null,"NTB.TT.102","Thuyền trưởng tàu hút bụng bậc 1/2",1,1,{"$f":"$E230/$E231*F231","v":0}]
[null,"NTB.TT.152","Thuyền trưởng tàu hút bụng bậc 1,5/2",1.5,1.02,{"$f":"'CB ĐGNC'!$D$38","v":0}]
[null,"NTB.TT.202","Thuyền trưởng tàu hút bụng bậc 2/2",2,1.04,{"$f":"$E232/$E231*F231","v":0}]
[null,null,"Máy trưởng, thuyền trưởng tàu cuốc, tàu hút phun, tàu đào gầu ngoạm"]
[null,"NTB.MT.102","Máy trưởng, thuyền trưởng tàu cuốc, tàu hút phun, tàu đào gầu ngoạm bậc 1/2",1,1,{"$f":"$E234/$E235*F235","v":0}]
[null,"NTB.MT.152","Máy trưởng, thuyền trưởng tàu cuốc, tàu hút phun, tàu đào gầu ngoạm bậc 1,5/2",1.5,1.02,{"$f":"'CB ĐGNC'!$D$39","v":0}]
[null,"NTB.MT.202","Máy trưởng, thuyền trưởng tàu cuốc, tàu hút phun, tàu đào gầu ngoạm bậc 2/2",2,1.04,{"$f":"$E236/$E235*F235","v":0}]
[null,null,"Điện trưởng tàu hút, tàu cuốc; KTV cuốc 1, thuyền phó 2 tàu hút bụng, KTV cuốc 2 tàu cuốc, tàu hút phun, tàu đào gầu ngoạm"]
[null,"NTB.DT.102","Điện trưởng tàu hút, tàu cuốc; KTV cuốc 1, thuyền phó 2 tàu hút bụng, KTV cuốc 2 tàu cuốc, tàu hút phun, tàu đào gầu ngoạm bậc 1/2",1,1,{"$f":"$E238/$E239*F239","v":0}]
[null,"NTB.DT.152","Điện trưởng tàu hút, tàu cuốc; KTV cuốc 1, thuyền phó 2 tàu hút bụng, KTV cuốc 2 tàu cuốc, tàu hút phun, tàu đào gầu ngoạm bậc 1,5/2",1.5,1.02,{"$f":"'CB ĐGNC'!$D$40","v":0}]
[null,"NTB.DT.202","Điện trưởng tàu hút, tàu cuốc; KTV cuốc 1, thuyền phó 2 tàu hút bụng, KTV cuốc 2 tàu cuốc, tàu hút phun, tàu đào gầu ngoạm bậc 2/2",2,1.04,{"$f":"$E240/$E239*F239","v":0}]
[null,null,"Máy 2; KTV cuốc 1 tàu cuốc, tàu hút phun, tàu đào gầu ngoạm"]
[null,"NTB.M2.102","Máy 2; KTV cuốc 1 tàu cuốc, tàu hút phun, tàu đào gầu ngoạm bậc 1/2",1,1,{"$f":"$E242/$E243*F243","v":0}]
[null,"NTB.M2.152","Máy 2; KTV cuốc 1 tàu cuốc, tàu hút phun, tàu đào gầu ngoạm bậc 1,5/2",1.5,1.02,{"$f":"'CB ĐGNC'!$D$41","v":0}]
[null,"NTB.M2.202","Máy 2; KTV cuốc 1 tàu cuốc, tàu hút phun, tàu đào gầu ngoạm bậc 2/2",2,1.04,{"$f":"$E244/$E243*F243","v":0}]
[null,null,"Thuyền phó tàu cuốc, KTV cuốc 2 tàu hút"]
[null,"NTB.TP.102","Thuyền phó tàu cuốc, KTV cuốc 2 tàu hút bậc 1/2",1,1,{"$f":"$E246/$E247*F247","v":0}]
[null,"NTB.TP.152","Thuyền phó tàu cuốc, KTV cuốc 2 tàu hút bậc 1,5/2",1.5,1.02,{"$f":"'CB ĐGNC'!$D$42","v":0}]
[null,"NTB.TP.202","Thuyền phó tàu cuốc, KTV cuốc 2 tàu hút bậc 2/2",2,1.04,{"$f":"$E248/$E247*F247","v":0}]
[]
[null,"BẢNG ĐƠN GIÁ NHÂN CÔNG DỊCH VỤ CÔNG ÍCH ĐÔ THỊ"]
[]
[null,null,"Mức lương cơ sở (MLcs):",1800000]
[null,null,"Hệ số điều chỉnh tăng thêm tiền lương:",null,null,null,"Theo các văn bản hướng dẫn tại địa phương"]
[null,null,"Các loại phụ cấp:"]
[null,null,"Phụ cấp nặng nhọc, độc hại, nguy hiểm:"]
[null,null,"Phụ cấp khu vực:"]
[null,null,"Phụ cấp lưu động:"]
[null,null,"Phụ cấp thu hút:"]
[null,null,"Hệ số không ổn định sản xuất:"]
[]
[null,"Mã","Nhóm nghề","Cấp bậc","Hệ số cấp bậc","Giá Nhân công tỉnh"]
[null,"I","Dịch vụ công ích đô thị (Dịch vụ quản lý công viên, trồng và chăm sóc cây xanh, hoa cảnh vỉa hè, đường phố, dải phân cách, vòng xoay; Dịch vụ chiếu sáng đô thị; Dịch vụ thu gom, phân loại, vận chuyển, xử lý chất thải, vệ sinh công cộng)"]
[null,"I.1","Nhân công nhóm 1"]
[null,"N01.DVCI107","Nhân công DVCI bậc 1,0/7 - Nhóm 1",1,1.55,{"$f":"(E264+SUM($D$255:$D$259))*$D$252*(1+$D$253)/26","v":107307.69230769231}]
[null,"N01.DVCI127","Nhân công DVCI bậc 1,2/7 - Nhóm 1",1.2,{"$f":"E264+(D265-D264)*(E269-E264)/(D269-D264)","v":1.6060000000000001},111184.61538461539]
[null,"N01.DVCI137","Nhân công DVCI bậc 1,3/7 - Nhóm 1",1.3,{"$f":"E264+(D266-D264)*(E269-E264)/(D269-D264)","v":1.6340000000000001},113123.07692307692]
[null,"N01.DVCI157","Nhân công DVCI bậc 1,5/7 - Nhóm 1",1.5,{"$f":"E264+(D267-D264)*(E269-E264)/(D269-D264)","v":1.69},117000]
[null,"N01.DVCI177","Nhân công DVCI bậc 1,7/7 - Nhóm 1",1.7,{"$f":"E264+(D268-D264)*(E269-E264)/(D269-D264)","v":1.746},120876.92307692308]
[null,"N01.DVCI207","Nhân công DVCI bậc 2,0/7 - Nhóm 1",2,1.83,126692.30769230769]
[null,"N01.DVCI227","Nhân công DVCI bậc 2,2/7 - Nhóm 1",2.2000000000000002,{"$f":"E269+(D270-D269)*(E274-E269)/(D274-D269)","v":1.8960000000000001},131261.53846153847]
[null,"N01.DVCI237","Nhân công DVCI bậc 2,3/7 - Nhóm 1",2.2999999999999998,{"$f":"E269+(D271-D269)*(E274-E269)/(D274-D269)","v":1.929},133546.15384615384]
[null,"N01.DVCI257","Nhân công DVCI bậc 2,5/7 - Nhóm 1",2.5,{"$f":"E269+(D272-D269)*(E274-E269)/(D274-D269)","v":1.9950000000000001},138115.38461538462]
[null,"N01.DVCI277","Nhân công DVCI bậc 2,7/7 - Nhóm 1",2.7,{"$f":"E269+(D273-D269)*(E274-E269)/(D274-D269)","v":2.0610000000000004},142684.6153846154]
[null,"N01.DVCI307","Nhân công DVCI bậc 3,0/7 - Nhóm 1",3,2.16,149538.46153846156]
[null,"N01.DVCI327","Nhân công DVCI bậc 3,2/7 - Nhóm 1",3.2,{"$f":"E274+(D275-D274)*(E279-E274)/(D279-D274)","v":2.238},154938.46153846153]
[null,"N01.DVCI337","Nhân công DVCI bậc 3,3/7 - Nhóm 1",3.3,{"$f":"E274+(D276-D274)*(E279-E274)/(D279-D274)","v":2.2770000000000001},157638.46153846156]
[null,"N01.DVCI357","Nhân công DVCI bậc 3,5/7 - Nhóm 1",3.5,{"$f":"E274+(D277-D274)*(E279-E274)/(D279-D274)","v":2.355},163038.46153846153]
[null,"N01.DVCI377","Nhân công DVCI bậc 3,7/7 - Nhóm 1",3.7,{"$f":"E274+(D278-D274)*(E279-E274)/(D279-D274)","v":2.4329999999999998},168438.46153846153]
[null,"N01.DVCI407","Nhân công DVCI bậc 4,0/7 - Nhóm 1",4,2.5499999999999998,176538.46153846153]
[null,"N01.DVCI427","Nhân công DVCI bậc 4,2/7 - Nhóm 1",4.2,{"$f":"E279+(D280-D279)*(E284-E279)/(D284-D279)","v":2.6419999999999999},182907.69230769231]
[null,"N01.DVCI437","Nhân công DVCI bậc 4,3/7 - Nhóm 1",4.3,{"$f":"E279+(D281-D279)*(E284-E279)/(D284-D279)","v":2.6879999999999997},186092.30769230766]
[null,"N01.DVCI457","Nhân công DVCI bậc 4,5/7 - Nhóm 1",4.5,{"$f":"E279+(D282-D279)*(E284-E279)/(D284-D279)","v":2.78},192461.53846153847]
[null,"N01.DVCI477","Nhân công DVCI bậc 4,7/7 - Nhóm 1",4.7,{"$f":"E279+(D283-D279)*(E284-E279)/(D284-D279)","v":2.8719999999999999},198830.76923076922]
[null,"N01.DVCI507","Nhân công DVCI bậc 5,0/7 - Nhóm 1",5,3.01,208384.61538461538]
[null,"N01.DVCI527","Nhân công DVCI bậc 5,2/7 - Nhóm 1",5.2,{"$f":"E284+(D285-D284)*(E289-E284)/(D289-D284)","v":3.12},216000]
[null,"N01.DVCI537","Nhân công DVCI bậc 5,3/7 - Nhóm 1",5.3,{"$f":"E284+(D286-D284)*(E289-E284)/(D289-D284)","v":3.1749999999999998},219807.69230769231]
[null,"N01.DVCI557","Nhân công DVCI bậc 5,5/7 - Nhóm 1",5.5,{"$f":"E284+(D287-D284)*(E289-E284)/(D289-D284)","v":3.2850000000000001},227423.07692307694]
[null,"N01.DVCI577","Nhân công DVCI bậc 5,7/7 - Nhóm 1",5.7,{"$f":"E284+(D288-D284)*(E289-E284)/(D289-D284)","v":3.395},235038.46153846153]
[null,"N01.DVCI607","Nhân công DVCI bậc 6,0/7 - Nhóm 1",6,3.56,246461.53846153847]
[null,"N01.DVCI627","Nhân công DVCI bậc 6,2/7 - Nhóm 1",6.2,{"$f":"E289+(D290-D289)*(E294-E289)/(D294-D289)","v":3.6880000000000002},255323.07692307694]
[null,"N01.DVCI637","Nhân công DVCI bậc 6,3/7 - Nhóm 1",6.3,{"$f":"E289+(D291-D289)*(E294-E289)/(D294-D289)","v":3.7519999999999998},259753.84615384616]
[null,"N01.DVCI657","Nhân công DVCI bậc 6,5/7 - Nhóm 1",6.5,{"$f":"E289+(D292-D289)*(E294-E289)/(D294-D289)","v":3.88},268615.38461538462]
[null,"N01.DVCI677","Nhân công DVCI bậc 6,7/7 - Nhóm 1",6.7,{"$f":"E289+(D293-D289)*(E294-E289)/(D294-D289)","v":4.008},277476.92307692306]
[null,"N01.DVCI707","Nhân công DVCI bậc 7,0/7 - Nhóm 1",7,4.2,290769.23076923075]
[null,"I.2","Nhân công nhóm 2"]
[null,"N02.DVCI107","Nhân công DVCI bậc 1,0/7 - Nhóm 2",1,1.67,{"$f":"(E296+SUM($D$255:$D$259)+$D$255)*$D$252*(1+$D$253)/26","v":115615.38461538461}]
[null,"N02.DVCI127","Nhân công DVCI bậc 1,2/7 - Nhóm 2",1.2,{"$f":"E296+(D297-D296)*(E301-E296)/(D301-D296)","v":1.728},119630.76923076923]
[null,"N02.DVCI137","Nhân công DVCI bậc 1,3/7 - Nhóm 2",1.3,{"$f":"E296+(D298-D296)*(E301-E296)/(D301-D296)","v":1.7569999999999999},121638.46153846153]
[null,"N02.DVCI157","Nhân công DVCI bậc 1,5/7 - Nhóm 2",1.5,{"$f":"E296+(D299-D296)*(E301-E296)/(D301-D296)","v":1.8149999999999999},125653.84615384616]
[null,"N02.DVCI177","Nhân công DVCI bậc 1,7/7 - Nhóm 2",1.7,{"$f":"E296+(D300-D296)*(E301-E296)/(D301-D296)","v":1.873},129669.23076923077]
[null,"N02.DVCI207","Nhân công DVCI bậc 2,0/7 - Nhóm 2",2,1.96,135692.30769230769]
[null,"N02.DVCI227","Nhân công DVCI bậc 2,2/7 - Nhóm 2",2.2000000000000002,{"$f":"E301+(D302-D301)*(E306-E301)/(D306-D301)","v":2.0300000000000002},140538.46153846156]
[null,"N02.DVCI237","Nhân công DVCI bậc 2,3/7 - Nhóm 2",2.2999999999999998,{"$f":"E301+(D303-D301)*(E306-E301)/(D306-D301)","v":2.0649999999999999},142961.53846153847]
[null,"N02.DVCI257","Nhân công DVCI bậc 2,5/7 - Nhóm 2",2.5,{"$f":"E301+(D304-D301)*(E306-E301)/(D306-D301)","v":2.1349999999999998},147807.69230769228]
[null,"N02.DVCI277","Nhân công DVCI bậc 2,7/7 - Nhóm 2",2.7,{"$f":"E301+(D305-D301)*(E306-E301)/(D306-D301)","v":2.2050000000000001},152653.84615384616]
[null,"N02.DVCI307","Nhân công DVCI bậc 3,0/7 - Nhóm 2",3,2.31,159923.07692307694]
[null,"N02.DVCI327","Nhân công DVCI bậc 3,2/7 - Nhóm 2",3.2,{"$f":"E306+(D307-D306)*(E311-E306)/(D311-D306)","v":2.39},165461.53846153847]
[null,"N02.DVCI337","Nhân công DVCI bậc 3,3/7 - Nhóm 2",3.3,{"$f":"E306+(D308-D306)*(E311-E306)/(D311-D306)","v":2.4300000000000002},168230.76923076922]
[null,"N02.DVCI357","Nhân công DVCI bậc 3,5/7 - Nhóm 2",3.5,{"$f":"E306+(D309-D306)*(E311-E306)/(D311-D306)","v":2.5099999999999998},173769.23076923078]
[null,"N02.DVCI377","Nhân công DVCI bậc 3,7/7 - Nhóm 2",3.7,{"$f":"E306+(D310-D306)*(E311-E306)/(D311-D306)","v":2.59},179307.69230769231]
[null,"N02.DVCI407","Nhân công DVCI bậc 4,0/7 - Nhóm 2",4,2.71,187615.38461538462]
[null,"N02.DVCI427","Nhân công DVCI bậc 4,2/7 - Nhóm 2",4.2,{"$f":"E311+(D312-D311)*(E316-E311)/(D316-D311)","v":2.806},194261.53846153847]
[null,"N02.DVCI437","Nhân công DVCI bậc 4,3/7 - Nhóm 2",4.3,{"$f":"E311+(D313-D311)*(E316-E311)/(D316-D311)","v":2.8540000000000001},197584.61538461538]
[null,"N02.DVCI457","Nhân công DVCI bậc 4,5/7 - Nhóm 2",4.5,{"$f":"E311+(D314-D311)*(E316-E311)/(D316-D311)","v":2.95},204230.76923076922]
[null,"N02.DVCI477","Nhân công DVCI bậc 4,7/7 - Nhóm 2",4.7,{"$f":"E311+(D315-D311)*(E316-E311)/(D316-D311)","v":3.0460000000000003},210876.92307692312]
[null,"N02.DVCI507","Nhân công DVCI bậc 5,0/7 - Nhóm 2",5,3.19,220846.15384615384]
[null,"N02.DVCI527","Nhân công DVCI bậc 5,2/7 - Nhóm 2",5.2,{"$f":"E316+(D317-D316)*(E321-E316)/(D321-D316)","v":3.3000000000000003},228461.5384615385]
[null,"N02.DVCI537","Nhân công DVCI bậc 5,3/7 - Nhóm 2",5.3,{"$f":"E316+(D318-D316)*(E321-E316)/(D321-D316)","v":3.355},232269.23076923078]
[null,"N02.DVCI557","Nhân công DVCI bậc 5,5/7 - Nhóm 2",5.5,{"$f":"E316+(D319-D316)*(E321-E316)/(D321-D316)","v":3.4649999999999999},239884.61538461538]
[null,"N02.DVCI577","Nhân công DVCI bậc 5,7/7 - Nhóm 2",5.7,{"$f":"E316+(D320-D316)*(E321-E316)/(D321-D316)","v":3.5750000000000002},247500]
[null,"N02.DVCI607","Nhân công DVCI bậc 6,0/7 - Nhóm 2",6,3.74,258923.07692307694]
[null,"N02.DVCI627","Nhân công DVCI bậc 6,2/7 - Nhóm 2",6.2,{"$f":"E321+(D322-D321)*(E326-E321)/(D326-D321)","v":3.8720000000000003},268061.5384615385]
[null,"N02.DVCI637","Nhân công DVCI bậc 6,3/7 - Nhóm 2",6.3,{"$f":"E321+(D323-D321)*(E326-E321)/(D326-D321)","v":3.9380000000000002},272630.76923076925]
[null,"N02.DVCI657","Nhân công DVCI bậc 6,5/7 - Nhóm 2",6.5,{"$f":"E321+(D324-D321)*(E326-E321)/(D326-D321)","v":4.07},281769.23076923081]
[null,"N02.DVCI677","Nhân công DVCI bậc 6,7/7 - Nhóm 2",6.7,{"$f":"E321+(D325-D321)*(E326-E321)/(D326-D321)","v":4.2020000000000008},290907.69230769237]
[null,"N02.DVCI707","Nhân công DVCI bậc 7,0/7 - Nhóm 2",7,4.4000000000000004,304615.38461538462]
[null,"I.3","Nhân công nhóm 3"]
[null,"N03.DVCI107","Nhân công DVCI bậc 1,0/7 - Nhóm 3",1,1.78,{"$f":"(E328+SUM($D$255:$D$259)+$D$255)*$D$252*(1+$D$253)/26","v":123230.76923076923}]
[null,"N03.DVCI127","Nhân công DVCI bậc 1,2/7 - Nhóm 3",1.2,{"$f":"E328+(D329-D328)*(E333-E328)/(D333-D328)","v":1.8440000000000001},127661.53846153847]
[null,"N03.DVCI137","Nhân công DVCI bậc 1,3/7 - Nhóm 3",1.3,{"$f":"E328+(D330-D328)*(E333-E328)/(D333-D328)","v":1.8760000000000001},129876.92307692308]
[null,"N03.DVCI157","Nhân công DVCI bậc 1,5/7 - Nhóm 3",1.5,{"$f":"E328+(D331-D328)*(E333-E328)/(D333-D328)","v":1.94},134307.69230769231]
[null,"N03.DVCI177","Nhân công DVCI bậc 1,7/7 - Nhóm 3",1.7,{"$f":"E328+(D332-D328)*(E333-E328)/(D333-D328)","v":2.004},138738.46153846153]
[null,"N03.DVCI207","Nhân công DVCI bậc 2,0/7 - Nhóm 3",2,2.1,145384.61538461538]
[null,"N03.DVCI227","Nhân công DVCI bậc 2,2/7 - Nhóm 3",2.2000000000000002,{"$f":"E333+(D334-D333)*(E338-E333)/(D338-D333)","v":2.1760000000000002},150646.15384615387]
[null,"N03.DVCI237","Nhân công DVCI bậc 2,3/7 - Nhóm 3",2.2999999999999998,{"$f":"E333+(D335-D333)*(E338-E333)/(D338-D333)","v":2.214},153276.92307692306]
[null,"N03.DVCI257","Nhân công DVCI bậc 2,5/7 - Nhóm 3",2.5,{"$f":"E333+(D336-D333)*(E338-E333)/(D338-D333)","v":2.29},158538.46153846153]
[null,"N03.DVCI277","Nhân công DVCI bậc 2,7/7 - Nhóm 3",2.7,{"$f":"E333+(D337-D333)*(E338-E333)/(D338-D333)","v":2.3660000000000001},163800]
[null,"N03.DVCI307","Nhân công DVCI bậc 3,0/7 - Nhóm 3",3,2.48,171692.30769230769]
[null,"N03.DVCI327","Nhân công DVCI bậc 3,2/7 - Nhóm 3",3.2,{"$f":"E338+(D339-D338)*(E343-E338)/(D343-D338)","v":2.5680000000000001},177784.61538461538]
[null,"N03.DVCI337","Nhân công DVCI bậc 3,3/7 - Nhóm 3",3.3,{"$f":"E338+(D340-D338)*(E343-E338)/(D343-D338)","v":2.6120000000000001},180830.76923076922]
[null,"N03.DVCI357","Nhân công DVCI bậc 3,5/7 - Nhóm 3",3.5,{"$f":"E338+(D341-D338)*(E343-E338)/(D343-D338)","v":2.7},186923.07692307694]
[null,"N03.DVCI377","Nhân công DVCI bậc 3,7/7 - Nhóm 3",3.7,{"$f":"E338+(D342-D338)*(E343-E338)/(D343-D338)","v":2.7880000000000003},193015.38461538462]
[null,"N03.DVCI407","Nhân công DVCI bậc 4,0/7 - Nhóm 3",4,2.92,202153.84615384616]
[null,"N03.DVCI427","Nhân công DVCI bậc 4,2/7 - Nhóm 3",4.2,{"$f":"E343+(D344-D343)*(E348-E343)/(D348-D343)","v":3.0260000000000002},209492.30769230769]
[null,"N03.DVCI437","Nhân công DVCI bậc 4,3/7 - Nhóm 3",4.3,{"$f":"E343+(D345-D343)*(E348-E343)/(D348-D343)","v":3.0789999999999997},213161.53846153844]
[null,"N03.DVCI457","Nhân công DVCI bậc 4,5/7 - Nhóm 3",4.5,{"$f":"E343+(D346-D343)*(E348-E343)/(D348-D343)","v":3.1850000000000001},220500]
[null,"N03.DVCI477","Nhân công DVCI bậc 4,7/7 - Nhóm 3",4.7,{"$f":"E343+(D347-D343)*(E348-E343)/(D348-D343)","v":3.2910000000000004},227838.46153846156]
[null,"N03.DVCI507","Nhân công DVCI bậc 5,0/7 - Nhóm 3",5,3.45,238846.15384615384]
[null,"N03.DVCI527","Nhân công DVCI bậc 5,2/7 - Nhóm 3",5.2,{"$f":"E348+(D349-D348)*(E353-E348)/(D353-D348)","v":3.5740000000000003},247430.76923076928]
[null,"N03.DVCI537","Nhân công DVCI bậc 5,3/7 - Nhóm 3",5.3,{"$f":"E348+(D350-D348)*(E353-E348)/(D353-D348)","v":3.6360000000000001},251723.07692307694]
[null,"N03.DVCI557","Nhân công DVCI bậc 5,5/7 - Nhóm 3",5.5,{"$f":"E348+(D351-D348)*(E353-E348)/(D353-D348)","v":3.7600000000000002},260307.69230769231]
[null,"N03.DVCI577","Nhân công DVCI bậc 5,7/7 - Nhóm 3",5.7,{"$f":"E348+(D352-D348)*(E353-E348)/(D353-D348)","v":3.8840000000000003},268892.30769230775]
[null,"N03.DVCI607","Nhân công DVCI bậc 6,0/7 - Nhóm 3",6,4.07,281769.23076923081]
[null,"N03.DVCI627","Nhân công DVCI bậc 6,2/7 - Nhóm 3",6.2,{"$f":"E353+(D354-D353)*(E358-E353)/(D358-D353)","v":4.2160000000000002},291876.92307692306]
[null,"N03.DVCI637","Nhân công DVCI bậc 6,3/7 - Nhóm 3",6.3,{"$f":"E353+(D355-D353)*(E358-E353)/(D358-D353)","v":4.2889999999999997},296930.76923076919]
[null,"N03.DVCI657","Nhân công DVCI bậc 6,5/7 - Nhóm 3",6.5,{"$f":"E353+(D356-D353)*(E358-E353)/(D358-D353)","v":4.4350000000000005},307038.46153846156]
[null,"N03.DVCI677","Nhân công DVCI bậc 6,7/7 - Nhóm 3",6.7,{"$f":"E353+(D357-D353)*(E358-E353)/(D358-D353)","v":4.5810000000000004},317146.15384615387]
[null,"N03.DVCI707","Nhân công DVCI bậc 7,0/7 - Nhóm 3",7,4.8,332307.69230769231]
[null,"II","Quản lý, bảo trì, duy tu các công trình giao thông (Quản lý, bảo trì kết cấu hạ tầng đường sắt; Dịch vụ sử dụng cảng, nhà ga; Quản lý, bảo trì kết cấu hạ tầng giao thông đường bộ; dịch vụ vận hành khai thác bến phà đường bộ; Quản lý, bảo trì đường thủy nội địa)"]
[null,"II.1","Nhân công nhóm 1"]
[null,"N01.BTDT107","Nhân công DVCI bậc 1,0/7 - Nhóm 1",1,1.55,{"$f":"(E361+SUM($D$255:$D$259))*$D$252*(1+$D$253)/26","v":107307.69230769231}]
[null,"N01.BTDT127","Nhân công DVCI bậc 1,2/7 - Nhóm 1",1.2,{"$f":"E361+(D362-D361)*(E366-E361)/(D366-D361)","v":1.6060000000000001},111184.61538461539]
[null,"N01.BTDT137","Nhân công DVCI bậc 1,3/7 - Nhóm 1",1.3,{"$f":"E361+(D363-D361)*(E366-E361)/(D366-D361)","v":1.6340000000000001},113123.07692307692]
[null,"N01.BTDT157","Nhân công DVCI bậc 1,5/7 - Nhóm 1",1.5,{"$f":"E361+(D364-D361)*(E366-E361)/(D366-D361)","v":1.69},117000]
[null,"N01.BTDT177","Nhân công DVCI bậc 1,7/7 - Nhóm 1",1.7,{"$f":"E361+(D365-D361)*(E366-E361)/(D366-D361)","v":1.746},120876.92307692308]
[null,"N01.BTDT207","Nhân công DVCI bậc 2,0/7 - Nhóm 1",2,1.83,126692.30769230769]
[null,"N01.BTDT227","Nhân công DVCI bậc 2,2/7 - Nhóm 1",2.2000000000000002,{"$f":"E366+(D367-D366)*(E371-E366)/(D371-D366)","v":1.8960000000000001},131261.53846153847]
[null,"N01.BTDT237","Nhân công DVCI bậc 2,3/7 - Nhóm 1",2.2999999999999998,{"$f":"E366+(D368-D366)*(E371-E366)/(D371-D366)","v":1.929},133546.15384615384]
[null,"N01.BTDT257","Nhân công DVCI bậc 2,5/7 - Nhóm 1",2.5,{"$f":"E366+(D369-D366)*(E371-E366)/(D371-D366)","v":1.9950000000000001},138115.38461538462]
[null,"N01.BTDT277","Nhân công DVCI bậc 2,7/7 - Nhóm 1",2.7,{"$f":"E366+(D370-D366)*(E371-E366)/(D371-D366)","v":2.0610000000000004},142684.6153846154]
[null,"N01.BTDT307","Nhân công DVCI bậc 3,0/7 - Nhóm 1",3,2.16,149538.46153846156]
[null,"N01.BTDT327","Nhân công DVCI bậc 3,2/7 - Nhóm 1",3.2,{"$f":"E371+(D372-D371)*(E376-E371)/(D376-D371)","v":2.238},154938.46153846153]
[null,"N01.BTDT337","Nhân công DVCI bậc 3,3/7 - Nhóm 1",3.3,{"$f":"E371+(D373-D371)*(E376-E371)/(D376-D371)","v":2.2770000000000001},157638.46153846156]
[null,"N01.BTDT357","Nhân công DVCI bậc 3,5/7 - Nhóm 1",3.5,{"$f":"E371+(D374-D371)*(E376-E371)/(D376-D371)","v":2.355},163038.46153846153]
[null,"N01.BTDT377","Nhân công DVCI bậc 3,7/7 - Nhóm 1",3.7,{"$f":"E371+(D375-D371)*(E376-E371)/(D376-D371)","v":2.4329999999999998},168438.46153846153]
[null,"N01.BTDT407","Nhân công DVCI bậc 4,0/7 - Nhóm 1",4,2.5499999999999998,176538.46153846153]
[null,"N01.BTDT427","Nhân công DVCI bậc 4,2/7 - Nhóm 1",4.2,{"$f":"E376+(D377-D376)*(E381-E376)/(D381-D376)","v":2.6419999999999999},182907.69230769231]
[null,"N01.BTDT437","Nhân công DVCI bậc 4,3/7 - Nhóm 1",4.3,{"$f":"E376+(D378-D376)*(E381-E376)/(D381-D376)","v":2.6879999999999997},186092.30769230766]
[null,"N01.BTDT457","Nhân công DVCI bậc 4,5/7 - Nhóm 1",4.5,{"$f":"E376+(D379-D376)*(E381-E376)/(D381-D376)","v":2.78},192461.53846153847]
[null,"N01.BTDT477","Nhân công DVCI bậc 4,7/7 - Nhóm 1",4.7,{"$f":"E376+(D380-D376)*(E381-E376)/(D381-D376)","v":2.8719999999999999},198830.76923076922]
[null,"N01.BTDT507","Nhân công DVCI bậc 5,0/7 - Nhóm 1",5,3.01,208384.61538461538]
[null,"N01.BTDT527","Nhân công DVCI bậc 5,2/7 - Nhóm 1",5.2,{"$f":"E381+(D382-D381)*(E386-E381)/(D386-D381)","v":3.12},216000]
[null,"N01.BTDT537","Nhân công DVCI bậc 5,3/7 - Nhóm 1",5.3,{"$f":"E381+(D383-D381)*(E386-E381)/(D386-D381)","v":3.1749999999999998},219807.69230769231]
[null,"N01.BTDT557","Nhân công DVCI bậc 5,5/7 - Nhóm 1",5.5,{"$f":"E381+(D384-D381)*(E386-E381)/(D386-D381)","v":3.2850000000000001},227423.07692307694]
[null,"N01.BTDT577","Nhân công DVCI bậc 5,7/7 - Nhóm 1",5.7,{"$f":"E381+(D385-D381)*(E386-E381)/(D386-D381)","v":3.395},235038.46153846153]
[null,"N01.BTDT607","Nhân công DVCI bậc 6,0/7 - Nhóm 1",6,3.56,246461.53846153847]
[null,"N01.BTDT627","Nhân công DVCI bậc 6,2/7 - Nhóm 1",6.2,{"$f":"E386+(D387-D386)*(E391-E386)/(D391-D386)","v":3.6880000000000002},255323.07692307694]
[null,"N01.BTDT637","Nhân công DVCI bậc 6,3/7 - Nhóm 1",6.3,{"$f":"E386+(D388-D386)*(E391-E386)/(D391-D386)","v":3.7519999999999998},259753.84615384616]
[null,"N01.BTDT657","Nhân công DVCI bậc 6,5/7 - Nhóm 1",6.5,{"$f":"E386+(D389-D386)*(E391-E386)/(D391-D386)","v":3.88},268615.38461538462]
[null,"N01.BTDT677","Nhân công DVCI bậc 6,7/7 - Nhóm 1",6.7,{"$f":"E386+(D390-D386)*(E391-E386)/(D391-D386)","v":4.008},277476.92307692306]
[null,"N01.BTDT707","Nhân công DVCI bậc 7,0/7 - Nhóm 1",7,4.2,290769.23076923075]
[null,"II.2","Nhân công nhóm 2"]
[null,"N02.BTDT107","Nhân công DVCI bậc 1,0/7 - Nhóm 2",1,1.67,{"$f":"(E393+SUM($D$255:$D$259)+$D$255)*$D$252*(1+$D$253)/26","v":115615.38461538461}]
[null,"N02.BTDT127","Nhân công DVCI bậc 1,2/7 - Nhóm 2",1.2,{"$f":"E393+(D394-D393)*(E398-E393)/(D398-D393)","v":1.728},119630.76923076923]
[null,"N02.BTDT137","Nhân công DVCI bậc 1,3/7 - Nhóm 2",1.3,{"$f":"E393+(D395-D393)*(E398-E393)/(D398-D393)","v":1.7569999999999999},121638.46153846153]
[null,"N02.BTDT157","Nhân công DVCI bậc 1,5/7 - Nhóm 2",1.5,{"$f":"E393+(D396-D393)*(E398-E393)/(D398-D393)","v":1.8149999999999999},125653.84615384616]
[null,"N02.BTDT177","Nhân công DVCI bậc 1,7/7 - Nhóm 2",1.7,{"$f":"E393+(D397-D393)*(E398-E393)/(D398-D393)","v":1.873},129669.23076923077]
[null,"N02.BTDT207","Nhân công DVCI bậc 2,0/7 - Nhóm 2",2,1.96,135692.30769230769]
[null,"N02.BTDT227","Nhân công DVCI bậc 2,2/7 - Nhóm 2",2.2000000000000002,{"$f":"E398+(D399-D398)*(E403-E398)/(D403-D398)","v":2.0300000000000002},140538.46153846156]
[null,"N02.BTDT237","Nhân công DVCI bậc 2,3/7 - Nhóm 2",2.2999999999999998,{"$f":"E398+(D400-D398)*(E403-E398)/(D403-D398)","v":2.0649999999999999},142961.53846153847]
[null,"N02.BTDT257","Nhân công DVCI bậc 2,5/7 - Nhóm 2",2.5,{"$f":"E398+(D401-D398)*(E403-E398)/(D403-D398)","v":2.1349999999999998},147807.69230769228]
[null,"N02.BTDT277","Nhân công DVCI bậc 2,7/7 - Nhóm 2",2.7,{"$f":"E398+(D402-D398)*(E403-E398)/(D403-D398)","v":2.2050000000000001},152653.84615384616]
[null,"N02.BTDT307","Nhân công DVCI bậc 3,0/7 - Nhóm 2",3,2.31,159923.07692307694]
[null,"N02.BTDT327","Nhân công DVCI bậc 3,2/7 - Nhóm 2",3.2,{"$f":"E403+(D404-D403)*(E408-E403)/(D408-D403)","v":2.39},165461.53846153847]
[null,"N02.BTDT337","Nhân công DVCI bậc 3,3/7 - Nhóm 2",3.3,{"$f":"E403+(D405-D403)*(E408-E403)/(D408-D403)","v":2.4300000000000002},168230.76923076922]
[null,"N02.BTDT357","Nhân công DVCI bậc 3,5/7 - Nhóm 2",3.5,{"$f":"E403+(D406-D403)*(E408-E403)/(D408-D403)","v":2.5099999999999998},173769.23076923078]
[null,"N02.BTDT377","Nhân công DVCI bậc 3,7/7 - Nhóm 2",3.7,{"$f":"E403+(D407-D403)*(E408-E403)/(D408-D403)","v":2.59},179307.69230769231]
[null,"N02.BTDT407","Nhân công DVCI bậc 4,0/7 - Nhóm 2",4,2.71,187615.38461538462]
[null,"N02.BTDT427","Nhân công DVCI bậc 4,2/7 - Nhóm 2",4.2,{"$f":"E408+(D409-D408)*(E413-E408)/(D413-D408)","v":2.806},194261.53846153847]
[null,"N02.BTDT437","Nhân công DVCI bậc 4,3/7 - Nhóm 2",4.3,{"$f":"E408+(D410-D408)*(E413-E408)/(D413-D408)","v":2.8540000000000001},197584.61538461538]
[null,"N02.BTDT457","Nhân công DVCI bậc 4,5/7 - Nhóm 2",4.5,{"$f":"E408+(D411-D408)*(E413-E408)/(D413-D408)","v":2.95},204230.76923076922]
[null,"N02.BTDT477","Nhân công DVCI bậc 4,7/7 - Nhóm 2",4.7,{"$f":"E408+(D412-D408)*(E413-E408)/(D413-D408)","v":3.0460000000000003},210876.92307692312]
[null,"N02.BTDT507","Nhân công DVCI bậc 5,0/7 - Nhóm 2",5,3.19,220846.15384615384]
[null,"N02.BTDT527","Nhân công DVCI bậc 5,2/7 - Nhóm 2",5.2,{"$f":"E413+(D414-D413)*(E418-E413)/(D418-D413)","v":3.3000000000000003},228461.5384615385]
[null,"N02.BTDT537","Nhân công DVCI bậc 5,3/7 - Nhóm 2",5.3,{"$f":"E413+(D415-D413)*(E418-E413)/(D418-D413)","v":3.355},232269.23076923078]
[null,"N02.BTDT557","Nhân công DVCI bậc 5,5/7 - Nhóm 2",5.5,{"$f":"E413+(D416-D413)*(E418-E413)/(D418-D413)","v":3.4649999999999999},239884.61538461538]
[null,"N02.BTDT577","Nhân công DVCI bậc 5,7/7 - Nhóm 2",5.7,{"$f":"E413+(D417-D413)*(E418-E413)/(D418-D413)","v":3.5750000000000002},247500]
[null,"N02.BTDT607","Nhân công DVCI bậc 6,0/7 - Nhóm 2",6,3.74,258923.07692307694]
[null,"N02.BTDT627","Nhân công DVCI bậc 6,2/7 - Nhóm 2",6.2,{"$f":"E418+(D419-D418)*(E423-E418)/(D423-D418)","v":3.8720000000000003},268061.5384615385]
[null,"N02.BTDT637","Nhân công DVCI bậc 6,3/7 - Nhóm 2",6.3,{"$f":"E418+(D420-D418)*(E423-E418)/(D423-D418)","v":3.9380000000000002},272630.76923076925]
[null,"N02.BTDT657","Nhân công DVCI bậc 6,5/7 - Nhóm 2",6.5,{"$f":"E418+(D421-D418)*(E423-E418)/(D423-D418)","v":4.07},281769.23076923081]
[null,"N02.BTDT677","Nhân công DVCI bậc 6,7/7 - Nhóm 2",6.7,{"$f":"E418+(D422-D418)*(E423-E418)/(D423-D418)","v":4.2020000000000008},290907.69230769237]
[null,"N02.BTDT707","Nhân công DVCI bậc 7,0/7 - Nhóm 2",7,4.4000000000000004,304615.38461538462]
[null,"II.3","Nhân công nhóm 3"]
[null,"N03.BTDT107","Nhân công DVCI bậc 1,0/7 - Nhóm 3",1,1.85,{"$f":"(E425+SUM($D$255:$D$259)+$D$255)*$D$252*(1+$D$253)/26","v":128076.92307692308}]
[null,"N03.BTDT127","Nhân công DVCI bậc 1,2/7 - Nhóm 3",1.2,{"$f":"E425+(D426-D425)*(E430-E425)/(D430-D425)","v":1.9160000000000001},132646.15384615387]
[null,"N03.BTDT137","Nhân công DVCI bậc 1,3/7 - Nhóm 3",1.3,{"$f":"E425+(D427-D425)*(E430-E425)/(D430-D425)","v":1.9490000000000001},134930.76923076922]
[null,"N03.BTDT157","Nhân công DVCI bậc 1,5/7 - Nhóm 3",1.5,{"$f":"E425+(D428-D425)*(E430-E425)/(D430-D425)","v":2.0150000000000001},139500]
[null,"N03.BTDT177","Nhân công DVCI bậc 1,7/7 - Nhóm 3",1.7,{"$f":"E425+(D429-D425)*(E430-E425)/(D430-D425)","v":2.081},144069.23076923078]
[null,"N03.BTDT207","Nhân công DVCI bậc 2,0/7 - Nhóm 3",2,2.1800000000000002,150923.07692307694]
[null,"N03.BTDT227","Nhân công DVCI bậc 2,2/7 - Nhóm 3",2.2000000000000002,{"$f":"E430+(D431-D430)*(E435-E430)/(D435-D430)","v":2.2560000000000002},156184.6153846154]
[null,"N03.BTDT237","Nhân công DVCI bậc 2,3/7 - Nhóm 3",2.2999999999999998,{"$f":"E430+(D432-D430)*(E435-E430)/(D435-D430)","v":2.294},158815.38461538462]
[null,"N03.BTDT257","Nhân công DVCI bậc 2,5/7 - Nhóm 3",2.5,{"$f":"E430+(D433-D430)*(E435-E430)/(D435-D430)","v":2.37},164076.92307692306]
[null,"N03.BTDT277","Nhân công DVCI bậc 2,7/7 - Nhóm 3",2.7,{"$f":"E430+(D434-D430)*(E435-E430)/(D435-D430)","v":2.4460000000000002},169338.46153846153]
[null,"N03.BTDT307","Nhân công DVCI bậc 3,0/7 - Nhóm 3",3,2.56,177230.76923076922]
[null,"N03.BTDT327","Nhân công DVCI bậc 3,2/7 - Nhóm 3",3.2,{"$f":"E435+(D436-D435)*(E440-E435)/(D440-D435)","v":2.65},183461.53846153847]
[null,"N03.BTDT337","Nhân công DVCI bậc 3,3/7 - Nhóm 3",3.3,{"$f":"E435+(D437-D435)*(E440-E435)/(D440-D435)","v":2.6949999999999998},186576.92307692306]
[null,"N03.BTDT357","Nhân công DVCI bậc 3,5/7 - Nhóm 3",3.5,{"$f":"E435+(D438-D435)*(E440-E435)/(D440-D435)","v":2.7850000000000001},192807.69230769231]
[null,"N03.BTDT377","Nhân công DVCI bậc 3,7/7 - Nhóm 3",3.7,{"$f":"E435+(D439-D435)*(E440-E435)/(D440-D435)","v":2.875},199038.46153846153]
[null,"N03.BTDT407","Nhân công DVCI bậc 4,0/7 - Nhóm 3",4,3.01,208384.61538461538]
[null,"N03.BTDT427","Nhân công DVCI bậc 4,2/7 - Nhóm 3",4.2,{"$f":"E440+(D441-D440)*(E445-E440)/(D445-D440)","v":3.1160000000000001},215723.07692307694]
[null,"N03.BTDT437","Nhân công DVCI bậc 4,3/7 - Nhóm 3",4.3,{"$f":"E440+(D442-D440)*(E445-E440)/(D445-D440)","v":3.1689999999999996},219392.30769230766]
[null,"N03.BTDT457","Nhân công DVCI bậc 4,5/7 - Nhóm 3",4.5,{"$f":"E440+(D443-D440)*(E445-E440)/(D445-D440)","v":3.2749999999999999},226730.76923076922]
[null,"N03.BTDT477","Nhân công DVCI bậc 4,7/7 - Nhóm 3",4.7,{"$f":"E440+(D444-D440)*(E445-E440)/(D445-D440)","v":3.3810000000000002},234069.23076923078]
[null,"N03.BTDT507","Nhân công DVCI bậc 5,0/7 - Nhóm 3",5,3.54,245076.92307692306]
[null,"N03.BTDT527","Nhân công DVCI bậc 5,2/7 - Nhóm 3",5.2,{"$f":"E445+(D446-D445)*(E450-E445)/(D450-D445)","v":3.6659999999999999},253800]
[null,"N03.BTDT537","Nhân công DVCI bậc 5,3/7 - Nhóm 3",5.3,{"$f":"E445+(D447-D445)*(E450-E445)/(D450-D445)","v":3.7290000000000001},258161.53846153847]
[null,"N03.BTDT557","Nhân công DVCI bậc 5,5/7 - Nhóm 3",5.5,{"$f":"E445+(D448-D445)*(E450-E445)/(D450-D445)","v":3.855},266884.61538461538]
[null,"N03.BTDT577","Nhân công DVCI bậc 5,7/7 - Nhóm 3",5.7,{"$f":"E445+(D449-D445)*(E450-E445)/(D450-D445)","v":3.9809999999999999},275607.69230769231]
[null,"N03.BTDT607","Nhân công DVCI bậc 6,0/7 - Nhóm 3",6,4.17,288692.30769230769]
[null,"N03.BTDT627","Nhân công DVCI bậc 6,2/7 - Nhóm 3",6.2,{"$f":"E450+(D451-D450)*(E455-E450)/(D455-D450)","v":4.3159999999999998},298800]
[null,"N03.BTDT637","Nhân công DVCI bậc 6,3/7 - Nhóm 3",6.3,{"$f":"E450+(D452-D450)*(E455-E450)/(D455-D450)","v":4.3890000000000002},303853.84615384613]
[null,"N03.BTDT657","Nhân công DVCI bậc 6,5/7 - Nhóm 3",6.5,{"$f":"E450+(D453-D450)*(E455-E450)/(D455-D450)","v":4.5350000000000001},313961.53846153844]
[null,"N03.BTDT677","Nhân công DVCI bậc 6,7/7 - Nhóm 3",6.7,{"$f":"E450+(D454-D450)*(E455-E450)/(D455-D450)","v":4.681},324069.23076923075]
[null,"N03.BTDT707","Nhân công DVCI bậc 7,0/7 - Nhóm 3",7,4.9000000000000004,339230.76923076925]
[null,"III","Chuyên viên, kỹ sư"]
[null,"NK.DVC.108","Kỹ sư DVC bậc 1,0/8",1,2.34,{"$f":"(E457+$D$255+$D$256)*$D$252*(1+$D$253)/26","v":162000}]
[null,"NK.DVC.208","Kỹ sư DVC bậc 2,0/8",2,2.65,183461.53846153847]
[null,"NK.DVC.308","Kỹ sư DVC bậc 3,0/8",3,2.96,204923.07692307694]
[null,"NK.DVC.408","Kỹ sư DVC bậc 4,0/8",4,3.27,226384.61538461538]
[null,"NK.DVC.458","Kỹ sư DVC bậc 4,5/8",4.5,{"$f":"E460+(D461-D460)*(E462-E460)/(D462-D460)","v":3.4249999999999998},237115.38461538462]
[null,"NK.DVC.508","Kỹ sư DVC bậc 5,0/8",5,3.58,247846.15384615384]
[null,"NK.DVC.608","Kỹ sư DVC bậc 6,0/8",6,3.89,269307.69230769231]
[null,"NK.DVC.708","Kỹ sư DVC bậc 7,0/8",7,4.2,290769.23076923075]
[null,"NK.DVC.808","Kỹ sư DVC bậc 8,0/8",8,4.51,312230.76923076925]
[null,"IV","Công nhân lái xe:"]
[null,null,"Nhóm 1: Xe con, xe tải, xe cẩu dưới 3,5 tấn, xe khách dưới 20 ghế"]
[null,"N01.LXCI1"," Công nhân lái xe bậc 1/4 - nhóm 1","1,0/4",2.1800000000000002,{"$f":"(E468+$D$255+$D$256)*$D$252*(1+$D$253)/26","v":150923.07692307694}]
[null,"N01.LXCI2"," Công nhân lái xe bậc 2/4 - nhóm 1","2,0/4",2.57,177923.07692307694]
[null,"N01.LXCI3"," Công nhân lái xe bậc 3/4 - nhóm 1","3,0/4",3.05,211153.84615384616]
[null,null," Nhóm 2: Xe tải, xe cẩu từ 3,5 tấn đến dưới 7,5 tấn, xe khách từ 20 ghế đến dưới 40 ghế",null,null,{"$f":"ROUND((E471+SUM($D$7:$D$10)+$D$6)*$D$3*(1+$D$4)/26,3)","v":0}]
[null,"N02.LXCI1"," Công nhân lái xe bậc 1/4 - nhóm 2","1,0/4",2.35,162692.30769230769]
[null,"N02.LXCI2"," Công nhân lái xe bậc 2/4 - nhóm 2","2,0/4",2.76,191076.92307692306]
[null,"N02.LXCI3"," Công nhân lái xe bậc 3/4 - nhóm 2","3,0/4",3.25,225000]
[null,null," Nhóm 3: Xe tải, xe cẩu từ 7,5 tấn đến dưới 16,5 tấn, xe khách từ 40 ghế đến dưới 60 ghế",null,null,0]
[null,"N03.LXCI1"," Công nhân lái xe bậc 1/4 - nhóm 3","1,0/4",2.5099999999999998,173769.23076923078]
[null,"N03.LXCI2"," Công nhân lái xe bậc 2/4 - nhóm 3","2,0/4",2.94,203538.46153846153]
[null,"N03.LXCI3"," Công nhân lái xe bậc 3/4 - nhóm 3","3,0/4",3.44,238153.84615384616]